{"text_format":"1","workbook":"xlsx","n_sheets":6,"sheets":["Instructions","IDI_Estimator","BHC_Estimator","Info","IDI","BHC"],"not_rendered":{"charts":0,"images":0,"macros":1,"external_links":0,"defined_names":31,"comments":0,"pivot_tables":0},"unopened":[],"bounds":{"document_bytes":16777216,"sheet_cells":100000,"rows_first":2000,"rows_last":500,"rows_between":2000,"halvings":0,"cell_chars":16384,"cell_head_chars":4096},"cells_cut":0,"cells_raw":0,"read":"whole","date_system":"1900"}

{"sheet":"Instructions","index":0,"n_rows":15,"n_cols":2,"rows_kept":15,"cut":false,"hidden":false,"merged":[[11,1,11,3],[0,0,0,3],[5,1,5,3],[7,1,7,3],[9,1,9,3],[1,1,1,3]]}
["Instructions for Completing the MDI/CDFI Capital Investment Estimation Tool "]
[null,"This tool estimates the effects of new capital investments on the ratios of Insured Depository Institutions (IDIs) and Bank Holding Companies (BHCs) related to new capital investments in Minority Depository Institutions (MDIs) and Community Development Financial Institutions (CDFIs). The tool has two separate tabs, \"IDI_Estimator\" to estimate IDI capital ratio effects, and \"BHC_Estimator\" to estimate BHC capital ratio effects. The tool may be used to estimate changes in IDI capital ratios due to a new capital investment at the BHC level that is downstreamed to the IDI. However, the downstreaming effect from a parent BHC to a subsidiary IDI is not automatically part of the tool; any effect from downstreaming capital to the IDI must be estimated separately in the IDI_Estimator tab.\n\nThis tool is designed solely for gauging the estimated regulatory capital ratio impact of new capital investments in MDIs/CDFIs and does not purport to predict an MDI or CDFI’s actual risk-based capital and leverage ratios. This tool is not a substitute for the MDI or CDFI’s own analysis of the impact of the new capital investment on its financial operations for regulatory reporting and related capital planning purposes. A particular MDI or CDFI’s risk-based capital and leverage ratios after a new capital investment, as reported in its FR Y-9C Schedule HC-R or Call Report Schedule RC-R, as applicable, may vary from the estimates produced using this tool."]
[]
["Step 1","For the IDI Estimator: Input the Certificate Number in the IDI_Estimator tab in cell B2.\nFor the BHC Estimator: Input the RSSD ID in the BHC_Estimator tab in cell B2."]
[]
["Step 2","Choose capital investment type(s) and enter in yellow cells M11 through M15. Enter amounts in thousands, using whole numbers and omitting decimal places. For cells corresponding to capital types in which no investment type is planned, enter 0 or leave blank."]
[]
["Step 3","Choose the risk weights that will apply to the assets funded by the capital investment, and enter the amounts in yellow cells D21 through M21. Enter amounts in thousands, using whole numbers and omitting decimal places. For cells corresponding to risk-weights for which no new capital investments will be used, enter 0 or leave blank. For CBLR-electing banks, risk-based capital ratios do not apply and risk-weighted assets are not calculated; therefore, cells D21 through M21 should be left blank."]
[]
["Step 4","View the post-investment capital and leverage ratios (or just leverage ratio for CBLR-electing banks) in cells F26 through I26. Cells immediately below F26 through I26 will display information about the ratios and if they exceed certain thresholds. See explanatory notes below the cells for more information."]
[]
["Notes:","Data in the underlying tool is based on 1st quarter 2021 regulatory reported data, sourced on May 21, 2021. \nThe estimates for holding companies derive from preliminary 1st quarter 2021 Y-9C data, which may be amended before finalization. Therefore, the estimates derived from the holding company tab may be affected by amendments to the Y-9C data related to a holding company's capital and leverage ratio items."]
[null,"Version: 20210521"]
[]
[null,"If there are any questions related to the tool, please contact Kyle McCormick at kmccormick@FDIC.gov"]

{"sheet":"IDI_Estimator","index":1,"n_rows":39,"n_cols":15,"rows_kept":39,"cut":false,"hidden":false,"merged":[[37,0,37,16],[1,5,1,8],[14,3,15,4],[38,0,38,16],[2,5,2,7],[2,8,3,8],[32,0,32,16],[10,5,10,11],[11,5,11,11],[12,5,13,11],[14,5,15,11],[9,3,9,4],[9,5,9,11],[5,3,5,4],[6,3,6,4],[10,3,10,4],[11,3,11,4],[12,3,13,4],[23,8,24,8],[23,5,23,7],[22,5,22,8],[31,0,31,16],[33,0,33,16],[34,0,34,16],[36,0,36,16],[26,3,26,4],[27,3,27,4],[28,3,28,4],[35,0,35,16]]}
[]
["Step 1: Enter MDI or CDFI Cert:",null,null,null,null,"Current capital ratios"]
["Name",{"$f":"IFERROR(VLOOKUP(B2, IDI!$B$6:$D$7000, COLUMN(IDI!$D$5)-COLUMN(IDI!$A$5), FALSE), \"\")","v":""},null,null,null,"Risk-based ratios",null,null,"Leverage ratio"]
[{"$f":"IFERROR(IF(VLOOKUP(B2, IDI!B6:AJ7000, COLUMN(IDI!AJ5)-COLUMN(IDI!A5), FALSE)=1, \"\", \"ERROR: Cert chosen is not an MDI or CDFI\"), \"ERROR: Cert chosen is not an MDI or CDFI\")","v":"ERROR: Cert chosen is not an MDI or CDFI"},null,null,null,null,"CET1","Tier 1","Total"]
[{"$f":"\"Reported bank information, \"&IF(RIGHT(MAX(IDI!A6:A10000),4)=\"0331\", \"1Q\", IF(RIGHT(MAX(IDI!A6:A10000),4)=\"0630\", \"2Q\", IF(RIGHT(MAX(IDI!A6:A10000),4)=\"0930\", \"3Q\",IF(RIGHT(MAX(IDI!A6:A10000),4)=\"1231\", \"4Q\", \"     ERROR     \"))))&LEFT(MAX(IDI!A6:A10000), 4)&\" ($ th.)\"","v":"Reported bank information, 1Q2021 ($ th.)"},null,null,null,null,{"$f":"IFERROR(IF(B9=\"Yes\", \"NA\", VLOOKUP(B2, IDI!$B$6:$V$7000, COLUMN(IDI!$V$5)-COLUMN(IDI!$A$5), FALSE)/100 ), \"\")","v":""},{"$f":"IFERROR(IF(B9=\"Yes\", \"NA\", VLOOKUP(B2, IDI!$B$6:$W$7000, COLUMN(IDI!$W$5)-COLUMN(IDI!$A$5), FALSE)/100 ), \"\")","v":""},{"$f":"IFERROR(IF(B9=\"Yes\", \"NA\", VLOOKUP(B2, IDI!$B$6:$X$7000, COLUMN(IDI!$X$5)-COLUMN(IDI!$A$5), FALSE)/100 ), \"\")","v":""},{"$f":"IFERROR(VLOOKUP(B2, IDI!$B$6:$Y$7000, COLUMN(IDI!$Y$5)-COLUMN(IDI!$A$5), FALSE)/100, \"\")","v":""}]
["State",{"$f":"IFERROR(VLOOKUP(B2, IDI!$B$6:$G$7000, COLUMN(IDI!$G$5)-COLUMN(IDI!$A$5), FALSE), \"\")","v":""},null,"PCA category4",null,{"$f":"IF(B11=\"\", \"\", IF(B9=\"Yes\",\"NA\", IF(F5>=6.5%, \"Well\", IF(AND(F5>=4.5%, F5<6.5%), \"Adeq\", IF(AND(F5>=3%, F5<4.5%), \"Under\", IF(F5<3%, \"Sig Under\")))) ))","v":""},{"$f":"IF(B11=\"\", \"\", IF(B9=\"Yes\",\"NA\", IF(G5>=8%, \"Well\", IF(AND(G5>=6%, G5<8%), \"Adeq\", IF(AND(G5>=4%, G5<6%), \"Under\", IF(G5<4%, \"Sig Under\")))) ))","v":""},{"$f":"IF(B11=\"\", \"\", IF(B9=\"Yes\",\"NA\",  IF(H5>=10%, \"Well\", IF(AND(H5>=8%, H5<10%), \"Adeq\", IF(AND(H5>=6%, H5<8%), \"Under\", IF(H5<6%, \"Sig Under\")))) ))","v":""},{"$f":"IF(B11=\"\", \"\", IF(B9=\"Yes\",IF(I5>8.5%,\"Well\",IF(AND(I5>7.5%,I5<=8.5%),\"Grace period\",\"Disq. from CBLR\")),IF(B9<>\"Yes\",IF(I5>=5%,\"Well\",IF(AND(I5>=4%,I5<5%),\"Adeq\",IF(AND(I5>=3%,I5<4%),\"Under\",IF(I5<3%,\"Sig under\")))))))","v":""}]
["PFR",{"$f":"IFERROR(VLOOKUP(B2, IDI!$B$6:$H$7000, COLUMN(IDI!$H$5)-COLUMN(IDI!$A$5), FALSE), \"\")","v":""},null,"Exceeds CCB?",null,{"$f":"IF(B11=\"\", \"\", IF($B9=\"Yes\",\"NA\", IF(F5>7%, \"Yes\", \"No\")))","v":""},{"$f":"IF(B11=\"\", \"\", IF($B9=\"Yes\",\"NA\", IF(G5>8.5%, \"Yes\", \"No\")))","v":""},{"$f":"IF(B11=\"\", \"\", IF($B9=\"Yes\",\"NA\", IF(H5>10.5%, \"Yes\", \"No\")))","v":""},"NA"]
["FDIC region",{"$f":"IFERROR(VLOOKUP(VLOOKUP(B2, IDI!$B$6:$K$7000, COLUMN(IDI!$K$5)-COLUMN(IDI!$A$5), FALSE), Info!K4:M11, 3, FALSE), \"\")","v":""}]
["CBLR bank?1",{"$f":"IFERROR(IF(VLOOKUP(B2, IDI!$B$6:$N$7000, COLUMN(IDI!$N$5)-COLUMN(IDI!$A$5), FALSE)=1, \"Yes\", \"No\"), \"\")","v":""},null,"Step 2: Choose investment type(s) and amount ($ th.)"]
["S-Corporation bank?2",{"$f":"IFERROR(IF(VLOOKUP(B2, IDI!$B$6:$AG$7000, COLUMN(IDI!$O$5)-COLUMN(IDI!$A$5), FALSE)=1, \"Yes\", \"No\"), \"\")","v":""},null,"Capital type",null,"Qualifying instruments5",null,null,null,null,null,null,"Amount, $ th."]
["Assets",{"$f":"IFERROR(VLOOKUP(B2, IDI!$B$6:$AG$7000, COLUMN(IDI!$F$5)-COLUMN(IDI!$A$5), FALSE), \"\")","v":""},null,"CET1",null,"Common stock, surplus and retained earnings",null,null,null,null,null,null,0]
["Risk weighted assets (RWA)",{"$f":"IFERROR(IF(B9=\"Yes\", \"NA\", VLOOKUP(B2, IDI!$B$6:$AG$7000, COLUMN(IDI!$U$5)-COLUMN(IDI!$A$5), FALSE) ), \"\")","v":""},null,"AT1",null,"Noncumulative perpetual preferred stock and related surplus",null,null,null,null,null,null,0]
["Common Equity Tier 1 (CET1) capital",{"$f":"IFERROR(VLOOKUP(B2, IDI!$B$6:$AG$7000, COLUMN(IDI!$R$5)-COLUMN(IDI!$A$5), FALSE), \"\")","v":""},null,"Tier 2",null,"Cumulative perpetual preferred stock and related surplus, and subordinated debt and limited-life preferred stock and related surplus",null,null,null,null,null,null,0]
["Additional Tier 1 (AT1) capital",{"$f":"IFERROR(VLOOKUP(B2, IDI!$B$6:$AG$7000, COLUMN(IDI!$Q$5)-COLUMN(IDI!$A$5), FALSE)-B13, \"\")","v":""}]
["Tier 2 capital",{"$f":"IFERROR(IF(B9=\"Yes\", \"NA\", VLOOKUP(B2,IDI!$B$6:$AG$7000,COLUMN(IDI!$S$5)-COLUMN(IDI!$A$5),FALSE)-SUM(B13:B14)), \"\")","v":""},null,"Non-regulatory capital",null,"Senior debt, deposits, deferred income and all other funding instruments that do not qualify as CET1, AT1, or Tier 2 capital",null,null,null,null,null,null,0]
["Average risk-weight3",{"$f":"IF(B9=\"Yes\", \"NA\", IF(B9=\"No\", B12/B11, \"\"))","v":""}]
[null,null,null,null,null,null,null,null,null,null,null,"Total invested ",{"$f":"SUM(M11, M12, M13, M15)","v":0}]
[]
[null,null,null,{"$f":"IF(B9=\"Yes\", \"Step 3: Risk weights not applicable; CBLR-electing banks do not report risk-based capital ratios\", \"Step 3: Choose how invested funds are risk-weighted ($ th.)\")","v":"Step 3: Choose how invested funds are risk-weighted ($ th.)"},null,null,null,null,null,null,null,null,"IDI avg. RW3"]
[null,null,null,0,0.2,0.5,1,1.5,2.5,3,4,6,{"$f":"B16","v":""},null,"Total risk-weighted"]
[null,null,null,0,0,0,0,0,0,0,0,0,0,null,{"$f":"SUM(D21:M21)","v":0}]
[null,null,null,null,null,{"$f":"IF(AND(SUM(D21:M21)<>SUM(M11:M16), B9=\"No\"), \"ERROR risk-weighted funds do not equal investment amounts\", \"\")","v":""}]
[null,null,null,null,null,"Post-investment capital ratios6"]
[null,null,null,null,null,"Risk-based ratios",null,null,"Leverage ratio7"]
[null,null,null,null,null,"CET1","Tier 1","Total"]
[null,null,null,null,null,{"$f":"IF(B11=\"\", \"\", IF(B9=\"Yes\",\"NA\",(B13+M11)/(B12+SUMPRODUCT(D20:M20,D21:M21))))","v":""},{"$f":"IF(B11=\"\", \"\", IF(B9=\"Yes\", \"NA\", (B13+B14+ SUM(M11:M12)) / (B12+SUMPRODUCT(D20:M20,D21:M21)) ))","v":""},{"$f":"IF(B11=\"\", \"\", IF(B9=\"Yes\", \"NA\", (B13+B14+B15 + SUM(M11:M13)) / (B12+SUMPRODUCT(D20:M20,D21:M21)) ))","v":""},{"$f":"IF(B11=\"\", \"\", (B13+B14 + SUM(M11:M12)) / (VLOOKUP(B2, IDI!$B$6:$AG$7000, COLUMN(IDI!$T$5)-COLUMN(IDI!$A$5), FALSE)+M17))","v":""}]
[null,null,null,"PCA category4",null,{"$f":"IF(B11=\"\", \"\", IF(B9=\"Yes\",\"NA\", IF(F26>=6.5%, \"Well\", IF(AND(F26>=4.5%, F26<6.5%), \"Adeq\", IF(AND(F26>=3%, F26<4.5%), \"Under\", IF(F26<3%, \"Sig Under\")))) ))","v":""},{"$f":"IF(B11=\"\", \"\", IF(B9=\"Yes\",\"NA\", IF(G26>=8%, \"Well\", IF(AND(G26>=6%, G26<8%), \"Adeq\", IF(AND(G26>=4%, G26<6%), \"Under\", IF(G26<4%, \"Sig Under\")))) ))","v":""},{"$f":"IF(B11=\"\", \"\", IF(B9=\"Yes\",\"NA\",  IF(H26>=10%, \"Well\", IF(AND(H26>=8%, H26<10%), \"Adeq\", IF(AND(H26>=6%, H26<8%), \"Under\", IF(H26<6%, \"Sig Under\")))) ))","v":""},{"$f":"IF(B11=\"\", \"\", IF(B9=\"Yes\",IF(I26>8.5%,\"Well\",IF(AND(I26>7.5%,I26<=8.5%),\"Grace period\",\"Ineligible for CBLR\")), IF(B9<>\"Yes\", IF(I26>=5%, \"Well\", IF(AND(I26>=4%, I26<5%), \"Adeq\", IF(AND(I26>=3%, I26<4%), \"Under\", IF(I26<3%, \"Sig under\")))))))","v":""}]
[null,null,null,"PCA change?",null,{"$f":"IF(B11=\"\", \"\", IF(F27<>F6, \"Yes\", \"No\"))","v":""},{"$f":"IF(B11=\"\", \"\", IF(G27<>G6, \"Yes\", \"No\"))","v":""},{"$f":"IF(B11=\"\", \"\", IF(H27<>H6, \"Yes\", \"No\"))","v":""},{"$f":"IF(B11=\"\", \"\", IF(I27<>I6, \"Yes\", \"No\"))","v":""}]
[null,null,null,"Exceeds CCB?8",null,{"$f":"IF(B11=\"\", \"\", IF($B9=\"Yes\",\"NA\", IF(F26>7%, \"Yes\", \"No\")))","v":""},{"$f":"IF(B11=\"\", \"\", IF($B9=\"Yes\",\"NA\", IF(G26>8.5%, \"Yes\", \"No\")))","v":""},{"$f":"IF(B11=\"\", \"\", IF($B9=\"Yes\",\"NA\", IF(H26>10.5%, \"Yes\", \"No\")))","v":""},"NA"]
[]
[{"$f":"\"Source: Call Report for MDI or CDFI insured depository institutions, \"&IF(RIGHT(MAX(IDI!A6:A10000),4)=\"0331\", \"1Q\", IF(RIGHT(MAX(IDI!A6:A10000),4)=\"0630\", \"2Q\", IF(RIGHT(MAX(IDI!A6:A10000),4)=\"0930\", \"3Q\",IF(RIGHT(MAX(IDI!A6:A10000),4)=\"1231\", \"4Q\", \"     ERROR     \"))))&LEFT(MAX(IDI!A6:A10000), 4)","v":"Source: Call Report for MDI or CDFI insured depository institutions, 1Q2021"}]
["1 - CBLR-electing banks only report their Tier 1 leverage ratio. Therefore, Tier 2 capital and risk-weighted assets (RWA) are not applicable to CBLR-electing banks. Further, the agencies issued a final rule which temporarily lowers the CBLR thresholds in 2021. As a result, the 2021 CBLR threshold applied in this estimator tool is >8.5% and the two-quarter grace period threshold is >7.5%. A CBLR-electing bank with a leverage ratio ≤ 7.5% in 2021 would no longer qualify to use the CBLR framework. In 2022, the CBLR threshold reverts to 9%. Accordingly, the estimator tool does not take into account a 9% CBLR threshold at this time."]
["2 - S-Corporation banks only have one class of stock, which is generally common stock, and so do not report any AT1 capital, which is limited under the capital rule to noncumulative perpetual preferred stock and related surplus. The calculator does not preclude the user from inputting an amount into AT1 for S-Corporation banks, but this is likely not a possible option."]
["3 - IDI average risk weight is the specific IDI's total RWA/total assets, before any investments."]
["4 - The Prompt Corrective Action (PCA) category is based on the reported ratios and does not take into account supervisory determinations that might affect the actual PCA category. The tool does not reflect whether an institution would be considered critically undercapitalized."]
["5 - Qualifying instruments are for illustrative purposes and are not limited to those listed above. To find a complete list of qualifying instruments, please see 12 CFR 3.20 (OCC); 12 CFR 217.20 (Board); or 12 CFR 324.20 (FDIC)."]
["6 - The pre- and post-investment ratios are the bank's reported ratios before and after the new capital investments, respectively; no examination or supervisory adjustments are incorporated into any of the capital ratios. The new capital investment(s) do not reset any regulatory capital-related deduction thresholds (e.g. the CET1 deduction thresholds for timing difference DTAs, the 1.25% RWA threshold for allowance includable in Tier 2 capital, etc)."]
["7 - The post-investment leverage ratio denominator includes the entire sum of the invested amounts. Because the leverage ratio denominator uses average assets over the quarter, an investment made in the middle of the quarter will not increase an MDI or CDFI's leverage ratio denominator by the full invested amount."]
["8 - The 2.5% Capital Conservation Buffer (CCB) is in addition to the minimum threshold for risk-based capital ratios. The minimum + CCB thresholds are 50 basis points higher than the Well Capitalized thresholds, i.e. 7.0% for the CET1 capital ratio, 8.5% for the Tier 1 capital ratio, and 10.5% for the Total capital ratio."]

{"sheet":"BHC_Estimator","index":2,"n_rows":37,"n_cols":15,"rows_kept":37,"cut":false,"hidden":false,"merged":[[35,0,35,16],[30,0,30,16],[1,5,1,8],[34,0,34,16],[36,0,36,16],[2,5,2,7],[2,8,3,8],[31,0,31,16],[5,3,5,4],[10,3,10,4],[9,3,9,4],[9,5,9,11],[11,5,11,11],[12,5,13,11],[14,5,15,11],[11,3,11,4],[12,3,13,4],[14,3,15,4],[10,5,10,11],[26,3,26,4],[22,5,22,8],[23,5,23,7],[23,8,24,8]]}
[]
["Step 1: Enter Holding Company RSSD ID:",null,null,null,null,"Current capital ratios"]
["Name",{"$f":"IFERROR(VLOOKUP(B2, BHC!B5:AC2000, COLUMN(BHC!C5)-COLUMN(BHC!A5), FALSE), \"\")","v":""},null,null,null,"Risk-based ratios",null,null,"Leverage ratio"]
[{"$f":"IFERROR(IF(VLOOKUP(B2, BHC!B6:AD2000, COLUMN(BHC!AD4)-COLUMN(BHC!A4), FALSE)=1, \"\", \"ERROR: RSSD ID chosen is not an MDI or CDFI holding company\"), \"ERROR: RSSD ID chosen is not an MDI or CDFI holding company\")","v":"ERROR: RSSD ID chosen is not an MDI or CDFI holding company"},null,null,null,null,"CET1","Tier 1","Total"]
[{"$f":"\"Reported holding company information, \"&IF(RIGHT(MAX(BHC!A6:A10000),4)=\"0331\", \"1Q\", IF(RIGHT(MAX(BHC!A6:A10000),4)=\"0630\", \"2Q\", IF(RIGHT(MAX(BHC!A6:A10000),4)=\"0930\", \"3Q\",IF(RIGHT(MAX(BHC!A6:A10000),4)=\"1231\", \"4Q\", \"     ERROR     \"))))&LEFT(MAX(BHC!A6:A10000), 4)&\" ($ th.)\"","v":"Reported holding company information, 1Q2021 ($ th.)"},null,null,null,null,{"$f":"IF(B9=\"\", \"\", IF(B7=\"Yes\", \"NA\", VLOOKUP(B2, BHC!B5:AC2000, COLUMN(BHC!R5)-COLUMN(BHC!A5), FALSE)/100 ))","v":""},{"$f":"IF(B9=\"\", \"\", IF(B7=\"Yes\", \"NA\",VLOOKUP(B2, BHC!B5:AC2000, COLUMN(BHC!S5)-COLUMN(BHC!A5), FALSE)/100 ))","v":""},{"$f":"IF(B9=\"\", \"\", IF(B7=\"Yes\", \"NA\", VLOOKUP(B2, BHC!B5:AC2000, COLUMN(BHC!T5)-COLUMN(BHC!A5), FALSE)/100 ))","v":""},{"$f":"IF(B9=\"\", \"\", VLOOKUP(B2, BHC!B5:AC2000, COLUMN(BHC!U5)-COLUMN(BHC!A5), FALSE)/100)","v":""}]
["State",{"$f":"IFERROR(VLOOKUP(B2, BHC!B5:AC2000, COLUMN(BHC!D5)-COLUMN(BHC!A5), FALSE), \"\")","v":""},null,"Exceeds CCB?",null,{"$f":"IF(B9=\"\", \"\", IF($B7=\"Yes\",\"NA\", IF(F5>7%, \"Yes\", \"No\")))","v":""},{"$f":"IF(B9=\"\", \"\", IF($B7=\"Yes\",\"NA\", IF(G5>8.5%, \"Yes\", \"No\")))","v":""},{"$f":"IF(B9=\"\", \"\", IF($B7=\"Yes\",\"NA\", IF(H5>10.5%, \"Yes\", \"No\")))","v":""},"NA"]
["CBLR holding company?1",{"$f":"IFERROR(IF(VLOOKUP(B2, BHC!B5:AC2000, COLUMN(BHC!J5)-COLUMN(BHC!A5), FALSE)=1, \"Yes\", \"No\"), \"\")","v":""},null,null,"Meets or exceeds min?",{"$f":"IF(B9=\"\", \"\", IF($B7=\"Yes\",\"NA\", IF(F5>=4.5%, \"Yes\", \"No\")))","v":""},{"$f":"IF(B9=\"\", \"\", IF($B7=\"Yes\",\"NA\", IF(G5>=6%, \"Yes\", \"No\")))","v":""},{"$f":"IF(B9=\"\", \"\", IF($B7=\"Yes\",\"NA\", IF(H5>=8%, \"Yes\", \"No\")))","v":""},{"$f":"IF(B9=\"\", \"\", IF(B7=\"Yes\",IF(I5>8.5%,\"Yes\",IF(AND(I5>7.5%,I5<=8.5%),\"Grace period\",IF(I5<=7.5%,\"Disq. from CBLR\"))),IF(B7<>\"Yes\",IF(I5>=4%,\"Yes\",\"No\"))))","v":""}]
["S-Corporation holding company?2",{"$f":"IFERROR(IF(VLOOKUP(B2, BHC!B5:AC2000, COLUMN(BHC!K5)-COLUMN(BHC!A5), FALSE)=1, \"Yes\", \"No\"), \"\")","v":""}]
["Assets",{"$f":"IFERROR(VLOOKUP(B2, BHC!B5:AC2000, COLUMN(BHC!I5)-COLUMN(BHC!A5), FALSE), \"\")","v":""},null,"Step 2: Choose investment type(s) ($ th.)"]
["Risk weighted assets (RWA)",{"$f":"IFERROR(IF(B7=\"Yes\", \"NA\", VLOOKUP(B2, BHC!B5:AC2000, COLUMN(BHC!Q5)-COLUMN(BHC!A5), FALSE) ), \"\")","v":""},null,"Capital type",null,"Qualifying instruments4",null,null,null,null,null,null,"Amount, $ th."]
["Common Equity Tier 1 (CET1) capital",{"$f":"IFERROR(VLOOKUP(B2, BHC!B5:AC2000, COLUMN(BHC!N5)-COLUMN(BHC!A5), FALSE), \"\")","v":""},null,"CET1",null,"Common stock, surplus and retained earnings",null,null,null,null,null,null,0]
["Additional Tier 1 (AT1) capital",{"$f":"IFERROR(VLOOKUP(B2, BHC!B5:AC2000, COLUMN(BHC!M5)-COLUMN(BHC!A5), FALSE)-B11, \"\")","v":""},null,"AT1",null,"Noncumulative perpetual preferred stock and related surplus",null,null,null,null,null,null,0]
["Tier 2 capital",{"$f":"IFERROR(IF(B7=\"Yes\", \"NA\", VLOOKUP(B2,BHC!B5:AC2000, COLUMN(BHC!O5)-COLUMN(BHC!A5),FALSE) - SUM(B11:B12)), \"\")","v":""},null,"Tier 2",null,"Cumulative perpetual preferred stock and related surplus, and subordinated debt and limited-life preferred stock and related surplus",null,null,null,null,null,null,0]
["Average risk-weight3",{"$f":"IFERROR(IF(B7=\"Yes\", \"NA\", B10/B9), \"\")","v":""}]
[null,null,null,"Non-regulatory capital",null,"Senior debt, deposits, deferred income and all other funding instruments that do not qualify as CET1, AT1, or Tier 2 capital",null,null,null,null,null,null,0]
[]
[null,null,null,null,null,null,null,null,null,null,null,"Total invested ",{"$f":"SUM(M11, M12, M13, M15)","v":0}]
[]
[null,null,null,{"$f":"IF(B7=\"Yes\", \"Step 3: Risk weights not applicable; CBLR-electing holding companies do not report risk-based capital ratios\", \"Step 3: Choose how invested funds are risk-weighted ($ th.)\")","v":"Step 3: Choose how invested funds are risk-weighted ($ th.)"},null,null,null,null,null,null,null,null,"BHC avg. RW3"]
[null,null,null,0,0.2,0.5,1,1.5,2.5,3,4,6,{"$f":"B14","v":""},null,"Total risk-weighted"]
[null,null,null,0,0,0,0,0,0,0,0,0,0,null,{"$f":"SUM(D21:M21)","v":0}]
[null,null,null,null,null,{"$f":"IF(AND(SUM(D21:M21)<>SUM(M11:M16), B7=\"No\"), \"ERROR risk-weighted funds do not equal investment amounts\", \"\")","v":""}]
[null,null,null,null,null,"Post-investment capital ratios5"]
[null,null,null,null,null,"Risk-based ratios",null,null,"Leverage ratio6"]
[null,null,null,null,null,"CET1","Tier 1","Total"]
[null,null,null,null,null,{"$f":"IF(B9=\"\", \"\", IF(B7=\"Yes\",\"NA\", (B11+M11)/(B10+SUMPRODUCT(D20:M20,D21:M21)) ))","v":""},{"$f":"IF(B9=\"\", \"\", IF(B7=\"Yes\", \"NA\", (SUM(B11:B12) + SUM(M11:M12)) / (B10+SUMPRODUCT(D20:M20,D21:M21)) ))","v":""},{"$f":"IF(B9=\"\", \"\", IF(B7=\"Yes\", \"NA\", (SUM(B11:B13) + SUM(M11:M13)) / (B10 + SUMPRODUCT(D20:M20,D21:M21)) ))","v":""},{"$f":"IF(B9=\"\", \"\", (SUM(B11:B12) + SUM(M11:M12)) / (VLOOKUP(B2, BHC!B5:AC2000, COLUMN(BHC!P5)-COLUMN(BHC!A5), FALSE) +M17))","v":""}]
[null,null,null,"Exceeds CCB?7",null,{"$f":"IF(B9=\"\", \"\", IF($B7=\"Yes\",\"NA\", IF(F26>7%, \"Yes\", \"No\")))","v":""},{"$f":"IF(B9=\"\", \"\", IF($B7=\"Yes\",\"NA\", IF(G26>8.5%, \"Yes\", \"No\")))","v":""},{"$f":"IF(B9=\"\", \"\", IF($B7=\"Yes\",\"NA\", IF(H26>10.5%, \"Yes\", \"No\")))","v":""},"NA"]
[null,null,null,null,"Meets or exceeds min?",{"$f":"IF(B9=\"\", \"\", IF($B7=\"Yes\",\"NA\", IF(F26>=4.5%, \"Yes\", \"No\")))","v":""},{"$f":"IF(B9=\"\", \"\", IF($B7=\"Yes\",\"NA\", IF(G26>=6%, \"Yes\", \"No\")))","v":""},{"$f":"IF(B9=\"\", \"\", IF($B7=\"Yes\",\"NA\", IF(H26>=8%, \"Yes\", \"No\")))","v":""},{"$f":"IF(B9=\"\", \"\", IF(B7=\"Yes\",IF(I26>8.5%,\"Yes\",IF(AND(I26>7.5%,I26<=8.5%),\"Grace period\",IF(I26<=7.5%,\"Ineligible for CBLR\"))),IF(B7<>\"Yes\",IF(I26>=4%,\"Yes\",\"No\"))))","v":""}]
[]
[{"$f":"\"Source: Y-9C for holding companies of MDI or CDFI insured depository institutions, \"&IF(RIGHT(MAX(BHC!A6:A1000),4)=\"0331\", \"1Q\", IF(RIGHT(MAX(BHC!A6:A1000),4)=\"0630\", \"2Q\", IF(RIGHT(MAX(BHC!A6:A1000),4)=\"0930\", \"3Q\",IF(RIGHT(MAX(BHC!A6:A1000),4)=\"1231\", \"4Q\", \"     ERROR     \"))))&LEFT(MAX(BHC!A6:A1000), 4)","v":"Source: Y-9C for holding companies of MDI or CDFI insured depository institutions, 1Q2021"}]
["1 - CBLR-electing BHCs only report their Tier 1 leverage ratio. Therefore Tier 2 capital and risk-weighted assets (RWA) are not applicable to CBLR-electing organizations. Further, the agencies issued a final rule which temporarily lowers the CBLR thresholds in 2021. As a result, the 2021 CBLR threshold applied in this estimator tool is >8.5% and the two-quarter grace period threshold is >7.5%. A CBLR-electing BHC with a leverage ratio ≤ 7.5% in 2021 would no longer qualify to use the CBLR framework. In 2022, the CBLR threshold reverts to 9%. Accordingly, the estimator tool does not take into account a 9% CBLR threshold at this time."]
["2 - S-Corporation holding companies only have one class of stock, which is generally common stock, and so do not report any AT1 capital, which is limited under the capital rule to noncumulative perpetual preferred stock. The calculator does not preclude the user from inputting an amount into AT1 for an S-Corporation holding company, but this is likely not a possible option."]
["3 - BHC average risk weight is the specific BHC's total RWA/total assets, before any investments."]
["4 - Qualifying instruments are for illustrative purposes and are not limited to those listed above. To find a complete list of qualifying instruments, please see 12 CFR 3.20 (OCC); 12 CFR 217.20 (Board); or 12 CFR 324.20 (FDIC)."]
["5 - The pre- and post-investment ratios are simply the holding companies' reported ratios before and after the new capital investments, respectively; no examination or supervisory adjustments are incorporated into any of the capital ratios. The new capital investment(s) do not reset any regulatory capital-related deduction thresholds (e.g. the CET1 deduction thresholds for timing difference DTAs, the 1.25% RWA threshold for allowance includable in Tier 2 capital, etc)."]
["6 - The post-investment leverage ratio denominator includes the entire sum of the invested amounts. Because the leverage ratio denominator uses average assets over the quarter, an investment made in the middle of the quarter will not increase an MDI or CDFI's leverage ratio denominator by the full invested amount."]
["7 - The 2.5% Capital Conservation Buffer (CCB) is in addition to the minimum threshold for risk-based capital ratios. The minimum + CCB thresholds are: 7.0% for the CET1 capital ratio, 8.5% for the Tier 1 capital ratio, and 10.5% for the Total capital ratio."]

{"sheet":"Info","index":3,"n_rows":178,"n_cols":17,"rows_kept":178,"cut":false,"hidden":true,"merged":[]}
[]
[]
[null,null,null,null,null,null,null,null,null,null,null,null,null,null,null,"CDFI numbers for 1Q2021, as of 5/21/2021"]
[null,null,null,null,null,null,null,null,null,null,2,"02 - NEW YORK REGION","New York",null,null,"Need updated 1Q list of OCC's women owned banks"]
[null,null,null,null,null,null,null,null,null,null,5,"05 - ATLANTA REGION","Atlanta",null,null,"CDFI IDIs","OCC's women owned"]
[null,null,null,null,null,null,null,null,null,null,9,"09 - CHICAGO REGION","Chicago",null,null,"CERT","CERT"]
[null,null,null,null,null,null,null,null,null,null,11,"11 - KANSAS CITY REGION","Kansas City",null,null,2779,4033]
[null,null,null,null,null,null,null,null,null,null,13,"13 - DALLAS REGION","Dallas",null,null,58,25644]
[null,null,null,null,null,null,null,null,null,null,14,"14 - SAN FRANCISCO REGION","San Francisco",null,null,39,19024]
[null,null,null,null,null,null,null,null,null,null,15,"15 - WASHINGTON OFFICE - RMS","Washington, RMS",null,null,855,13798]
[null,null,null,null,null,null,null,null,null,null,16,"16 - WASHINGTON OFFICE - CFI","Washington, CFI",null,null,57483,4161]
[null,null,null,null,null,null,null,null,null,null,null,null,null,null,null,15695,14400]
[null,null,null,null,null,null,null,null,null,null,null,null,null,null,null,22229,19819]
[null,null,null,null,null,null,null,null,null,null,null,null,null,null,null,9057,26181]
[null,null,null,null,null,null,null,null,null,null,null,null,null,null,null,58357,5410]
[null,null,null,null,null,null,null,null,null,null,null,null,null,null,null,58255,11252]
[null,null,null,null,null,null,null,null,null,null,null,null,null,null,null,16175,4477]
[null,null,null,null,null,null,null,null,null,null,null,null,null,null,null,16185,7590]
[null,null,null,null,null,null,null,null,null,null,null,null,null,null,null,2828,5520]
[null,null,null,null,null,null,null,null,null,null,null,null,null,null,null,51]
[null,null,null,null,null,null,null,null,null,null,null,null,null,null,null,8033]
[null,null,null,null,null,null,null,null,null,null,null,null,null,null,null,17190]
[null,null,null,null,null,null,null,null,null,null,null,null,null,null,null,20198]
[null,null,null,null,null,null,null,null,null,null,null,null,null,null,null,16584]
[null,null,null,null,null,null,null,null,null,null,null,null,null,null,null,12266]
[null,null,null,null,null,null,null,null,null,null,null,null,null,null,null,31100]
[null,null,null,null,null,null,null,null,null,null,null,null,null,null,null,35241]
[null,null,null,null,null,null,null,null,null,null,null,null,null,null,null,58658]
[null,null,null,null,null,null,null,null,null,null,null,null,null,null,null,2448]
[null,null,null,null,null,null,null,null,null,null,null,null,null,null,null,25883]
[null,null,null,null,null,null,null,null,null,null,null,null,null,null,null,29399]
[null,null,null,null,null,null,null,null,null,null,null,null,null,null,null,33708]
[null,null,null,null,null,null,null,null,null,null,null,null,null,null,null,28611]
[null,null,null,null,null,null,null,null,null,null,null,null,null,null,null,34108]
[null,null,null,null,null,null,null,null,null,null,null,null,null,null,null,20179]
[null,null,null,null,null,null,null,null,null,null,null,null,null,null,null,34052]
[null,null,null,null,null,null,null,null,null,null,null,null,null,null,null,28480]
[null,null,null,null,null,null,null,null,null,null,null,null,null,null,null,1528]
[null,null,null,null,null,null,null,null,null,null,null,null,null,null,null,1294]
[null,null,null,null,null,null,null,null,null,null,null,null,null,null,null,1027]
[null,null,null,null,null,null,null,null,null,null,null,null,null,null,null,1028]
[null,null,null,null,null,null,null,null,null,null,null,null,null,null,null,15729]
[null,null,null,null,null,null,null,null,null,null,null,null,null,null,null,15547]
[null,null,null,null,null,null,null,null,null,null,null,null,null,null,null,21379]
[null,null,null,null,null,null,null,null,null,null,null,null,null,null,null,11242]
[null,null,null,null,null,null,null,null,null,null,null,null,null,null,null,90]
[null,null,null,null,null,null,null,null,null,null,null,null,null,null,null,1753]
[null,null,null,null,null,null,null,null,null,null,null,null,null,null,null,5628]
[null,null,null,null,null,null,null,null,null,null,null,null,null,null,null,94]
[null,null,null,null,null,null,null,null,null,null,null,null,null,null,null,19644]
[null,null,null,null,null,null,null,null,null,null,null,null,null,null,null,57741]
[null,null,null,null,null,null,null,null,null,null,null,null,null,null,null,27026]
[null,null,null,null,null,null,null,null,null,null,null,null,null,null,null,9327]
[null,null,null,null,null,null,null,null,null,null,null,null,null,null,null,307]
[null,null,null,null,null,null,null,null,null,null,null,null,null,null,null,8140]
[null,null,null,null,null,null,null,null,null,null,null,null,null,null,null,11785]
[null,null,null,null,null,null,null,null,null,null,null,null,null,null,null,32459]
[null,null,null,null,null,null,null,null,null,null,null,null,null,null,null,8798]
[null,null,null,null,null,null,null,null,null,null,null,null,null,null,null,34784]
[null,null,null,null,null,null,null,null,null,null,null,null,null,null,null,19638]
[null,null,null,null,null,null,null,null,null,null,null,null,null,null,null,16689]
[null,null,null,null,null,null,null,null,null,null,null,null,null,null,null,10532]
[null,null,null,null,null,null,null,null,null,null,null,null,null,null,null,24443]
[null,null,null,null,null,null,null,null,null,null,null,null,null,null,null,1373]
[null,null,null,null,null,null,null,null,null,null,null,null,null,null,null,10528]
[null,null,null,null,null,null,null,null,null,null,null,null,null,null,null,20856]
[null,null,null,null,null,null,null,null,null,null,null,null,null,null,null,8533]
[null,null,null,null,null,null,null,null,null,null,null,null,null,null,null,29804]
[null,null,null,null,null,null,null,null,null,null,null,null,null,null,null,19800]
[null,null,null,null,null,null,null,null,null,null,null,null,null,null,null,19143]
[null,null,null,null,null,null,null,null,null,null,null,null,null,null,null,22739]
[null,null,null,null,null,null,null,null,null,null,null,null,null,null,null,9322]
[null,null,null,null,null,null,null,null,null,null,null,null,null,null,null,8527]
[null,null,null,null,null,null,null,null,null,null,null,null,null,null,null,26564]
[null,null,null,null,null,null,null,null,null,null,null,null,null,null,null,10531]
[null,null,null,null,null,null,null,null,null,null,null,null,null,null,null,11792]
[null,null,null,null,null,null,null,null,null,null,null,null,null,null,null,10533]
[null,null,null,null,null,null,null,null,null,null,null,null,null,null,null,306]
[null,null,null,null,null,null,null,null,null,null,null,null,null,null,null,28949]
[null,null,null,null,null,null,null,null,null,null,null,null,null,null,null,8243]
[null,null,null,null,null,null,null,null,null,null,null,null,null,null,null,15801]
[null,null,null,null,null,null,null,null,null,null,null,null,null,null,null,17120]
[null,null,null,null,null,null,null,null,null,null,null,null,null,null,null,22081]
[null,null,null,null,null,null,null,null,null,null,null,null,null,null,null,5903]
[null,null,null,null,null,null,null,null,null,null,null,null,null,null,null,15953]
[null,null,null,null,null,null,null,null,null,null,null,null,null,null,null,15817]
[null,null,null,null,null,null,null,null,null,null,null,null,null,null,null,35439]
[null,null,null,null,null,null,null,null,null,null,null,null,null,null,null,12201]
[null,null,null,null,null,null,null,null,null,null,null,null,null,null,null,21998]
[null,null,null,null,null,null,null,null,null,null,null,null,null,null,null,324]
[null,null,null,null,null,null,null,null,null,null,null,null,null,null,null,31158]
[null,null,null,null,null,null,null,null,null,null,null,null,null,null,null,8870]
[null,null,null,null,null,null,null,null,null,null,null,null,null,null,null,34938]
[null,null,null,null,null,null,null,null,null,null,null,null,null,null,null,9356]
[null,null,null,null,null,null,null,null,null,null,null,null,null,null,null,11445]
[null,null,null,null,null,null,null,null,null,null,null,null,null,null,null,9359]
[null,null,null,null,null,null,null,null,null,null,null,null,null,null,null,34217]
[null,null,null,null,null,null,null,null,null,null,null,null,null,null,null,8231]
[null,null,null,null,null,null,null,null,null,null,null,null,null,null,null,8232]
[null,null,null,null,null,null,null,null,null,null,null,null,null,null,null,11446]
[null,null,null,null,null,null,null,null,null,null,null,null,null,null,null,8235]
[null,null,null,null,null,null,null,null,null,null,null,null,null,null,null,19226]
[null,null,null,null,null,null,null,null,null,null,null,null,null,null,null,9775]
[null,null,null,null,null,null,null,null,null,null,null,null,null,null,null,321]
[null,null,null,null,null,null,null,null,null,null,null,null,null,null,null,21906]
[null,null,null,null,null,null,null,null,null,null,null,null,null,null,null,9777]
[null,null,null,null,null,null,null,null,null,null,null,null,null,null,null,5907]
[null,null,null,null,null,null,null,null,null,null,null,null,null,null,null,26379]
[null,null,null,null,null,null,null,null,null,null,null,null,null,null,null,10594]
[null,null,null,null,null,null,null,null,null,null,null,null,null,null,null,9366]
[null,null,null,null,null,null,null,null,null,null,null,null,null,null,null,8552]
[null,null,null,null,null,null,null,null,null,null,null,null,null,null,null,4993]
[null,null,null,null,null,null,null,null,null,null,null,null,null,null,null,21083]
[null,null,null,null,null,null,null,null,null,null,null,null,null,null,null,19448]
[null,null,null,null,null,null,null,null,null,null,null,null,null,null,null,5902]
[null,null,null,null,null,null,null,null,null,null,null,null,null,null,null,5005]
[null,null,null,null,null,null,null,null,null,null,null,null,null,null,null,57034]
[null,null,null,null,null,null,null,null,null,null,null,null,null,null,null,30812]
[null,null,null,null,null,null,null,null,null,null,null,null,null,null,null,12203]
[null,null,null,null,null,null,null,null,null,null,null,null,null,null,null,16612]
[null,null,null,null,null,null,null,null,null,null,null,null,null,null,null,327]
[null,null,null,null,null,null,null,null,null,null,null,null,null,null,null,11817]
[null,null,null,null,null,null,null,null,null,null,null,null,null,null,null,15871]
[null,null,null,null,null,null,null,null,null,null,null,null,null,null,null,11423]
[null,null,null,null,null,null,null,null,null,null,null,null,null,null,null,8234]
[null,null,null,null,null,null,null,null,null,null,null,null,null,null,null,12206]
[null,null,null,null,null,null,null,null,null,null,null,null,null,null,null,15663]
[null,null,null,null,null,null,null,null,null,null,null,null,null,null,null,12207]
[null,null,null,null,null,null,null,null,null,null,null,null,null,null,null,2327]
[null,null,null,null,null,null,null,null,null,null,null,null,null,null,null,11521]
[null,null,null,null,null,null,null,null,null,null,null,null,null,null,null,8980]
[null,null,null,null,null,null,null,null,null,null,null,null,null,null,null,22020]
[null,null,null,null,null,null,null,null,null,null,null,null,null,null,null,6101]
[null,null,null,null,null,null,null,null,null,null,null,null,null,null,null,1705]
[null,null,null,null,null,null,null,null,null,null,null,null,null,null,null,2380]
[null,null,null,null,null,null,null,null,null,null,null,null,null,null,null,31272]
[null,null,null,null,null,null,null,null,null,null,null,null,null,null,null,15205]
[null,null,null,null,null,null,null,null,null,null,null,null,null,null,null,16511]
[null,null,null,null,null,null,null,null,null,null,null,null,null,null,null,10319]
[null,null,null,null,null,null,null,null,null,null,null,null,null,null,null,8660]
[null,null,null,null,null,null,null,null,null,null,null,null,null,null,null,9172]
[null,null,null,null,null,null,null,null,null,null,null,null,null,null,null,8439]
[null,null,null,null,null,null,null,null,null,null,null,null,null,null,null,9168]
[null,null,null,null,null,null,null,null,null,null,null,null,null,null,null,17881]
[null,null,null,null,null,null,null,null,null,null,null,null,null,null,null,26223]
[null,null,null,null,null,null,null,null,null,null,null,null,null,null,null,3337]
[null,null,null,null,null,null,null,null,null,null,null,null,null,null,null,13959]
[null,null,null,null,null,null,null,null,null,null,null,null,null,null,null,18561]
[null,null,null,null,null,null,null,null,null,null,null,null,null,null,null,11003]
[null,null,null,null,null,null,null,null,null,null,null,null,null,null,null,8296]
[null,null,null,null,null,null,null,null,null,null,null,null,null,null,null,22394]
[null,null,null,null,null,null,null,null,null,null,null,null,null,null,null,17009]
[null,null,null,null,null,null,null,null,null,null,null,null,null,null,null,19349]
[null,null,null,null,null,null,null,null,null,null,null,null,null,null,null,22319]
[null,null,null,null,null,null,null,null,null,null,null,null,null,null,null,58952]
[null,null,null,null,null,null,null,null,null,null,null,null,null,null,null,34352]
[null,null,null,null,null,null,null,null,null,null,null,null,null,null,null,14679]
[null,null,null,null,null,null,null,null,null,null,null,null,null,null,null,24015]
[null,null,null,null,null,null,null,null,null,null,null,null,null,null,null,31189]
[null,null,null,null,null,null,null,null,null,null,null,null,null,null,null,58668]
[null,null,null,null,null,null,null,null,null,null,null,null,null,null,null,30394]
[null,null,null,null,null,null,null,null,null,null,null,null,null,null,null,57807]
[null,null,null,null,null,null,null,null,null,null,null,null,null,null,null,58641]
[null,null,null,null,null,null,null,null,null,null,null,null,null,null,null,58196]
[null,null,null,null,null,null,null,null,null,null,null,null,null,null,null,34759]
[null,null,null,null,null,null,null,null,null,null,null,null,null,null,null,33568]
[null,null,null,null,null,null,null,null,null,null,null,null,null,null,null,58469]
[null,null,null,null,null,null,null,null,null,null,null,null,null,null,null,57966]
[null,null,null,null,null,null,null,null,null,null,null,null,null,null,null,26363]
[null,null,null,null,null,null,null,null,null,null,null,null,null,null,null,30306]
[null,null,null,null,null,null,null,null,null,null,null,null,null,null,null,58816]
[null,null,null,null,null,null,null,null,null,null,null,null,null,null,null,58490]
[null,null,null,null,null,null,null,null,null,null,null,null,null,null,null,34210]
[null,null,null,null,null,null,null,null,null,null,null,null,null,null,null,58060]
[null,null,null,null,null,null,null,null,null,null,null,null,null,null,null,34548]
[null,null,null,null,null,null,null,null,null,null,null,null,null,null,null,23749]
[null,null,null,null,null,null,null,null,null,null,null,null,null,null,null,57101]
[null,null,null,null,null,null,null,null,null,null,null,null,null,null,null,23966]

{"sheet":"IDI","index":4,"n_rows":5112,"n_cols":36,"rows_kept":5112,"cut":false,"hidden":true,"merged":[]}
[]
[null,null,null,null,null,null,null,"Count MDIs:",{"$f":"COUNT(IF(P6:P7000=1, B6:B7000))","v":142}]
[null,null,null,null,null,null,null,"Count FDIC MDIs:",{"$f":"COUNT(IF(P6:P7000=1, IF(H6:H7000=\"FDIC\", B6:B7000)))","v":94}]
[null,null,null,null,null,null,null,null,null,null,null,null,null,null,null,"MDI flag","Tier 1 Capital","CET1 Capital","Total Capital","Total assets for leverage ratio","SA RWA","CET1 RBC ratio","Tier 1 RBC ratio","Total RBC ratio","Leverage ratio","Cash, Noninterest-bearing balances and currency and coin","Cash, Interest-bearing balances","Total loans, domestic","Securities, HTM","Securities, AFS","Securities, equities","Trading assets","Intangible assets","CDFI IDI?","OCC's Women Owned Flag","CDFI or MDI"]
["CALLYMD","CERT","RSSDID","NAMEFULL","INSALL","ASSET","STALP","REGAGNT","BKCLASS","MUTUAL","FDICSUPV","RSSDHCR","RSSDHCD","CBLRIND","SUBCHAPS","MINORITY","RBCT1W","RBCT1C","RBCW","AVASSETW","RCR40A","RBCT1CER","RBC1RWAJ","RBCRWAJ","RBC1AAJ","CHBALNI","CHBALI","LNLSGRD","SCHANET","SCAF","SCEQFV","TRADE","INTAN","CDFI","WO Flag","CDFI or MDI"]
[20210331,39,430036,"ROBERTSON BANKING COMPANY",1,392708,"AL","FDIC","NM",0,5,2526755,2526755,0,1,0,35727,35727,39186,381655,276369,12.93,12.93,14.18,9.36,30154,28616,276004,0,50505,0,0,0,{"$f":"IFERROR(VLOOKUP(B6, Info!$P$7:$P$1000, 1, FALSE)/VLOOKUP(B6, Info!$P$7:$P$1000, 1, FALSE), 0)","v":1},{"$f":"IFERROR(VLOOKUP(B6, Info!$Q$7:$Q$1000, 1, FALSE)/VLOOKUP(B6, Info!$Q$7:$Q$1000, 1, FALSE), 0)","v":0},{"$f":"IF(OR(P6=1, AH6=1, AI6=1), 1, 0)","v":1}]
[20210331,51,382537,"THE BANK OF VERNON",1,216844,"AL","FDIC","NM",0,5,1139998,1139998,1,0,0,27007,27007,0,213202,0,null,null,null,12.67,3072,47613,132910,0,28125,0,0,0,{"$f":"IFERROR(VLOOKUP(B7, Info!$P$7:$P$1000, 1, FALSE)/VLOOKUP(B7, Info!$P$7:$P$1000, 1, FALSE), 0)","v":1},{"$f":"IFERROR(VLOOKUP(B7, Info!$Q$7:$Q$1000, 1, FALSE)/VLOOKUP(B7, Info!$Q$7:$Q$1000, 1, FALSE), 0)","v":0},{"$f":"IF(OR(P7=1, AH7=1, AI7=1), 1, 0)","v":1}]
[20210331,58,994435,"UNITED BANK",1,929024,"AL","FDIC","NM",0,5,1083895,1083895,0,0,0,82649,82649,89831,904581,573165,14.42,14.42,15.67,9.14,46234,131412,556118,14690,152525,0,0,0,{"$f":"IFERROR(VLOOKUP(B8, Info!$P$7:$P$1000, 1, FALSE)/VLOOKUP(B8, Info!$P$7:$P$1000, 1, FALSE), 0)","v":1},{"$f":"IFERROR(VLOOKUP(B8, Info!$Q$7:$Q$1000, 1, FALSE)/VLOOKUP(B8, Info!$Q$7:$Q$1000, 1, FALSE), 0)","v":0},{"$f":"IF(OR(P8=1, AH8=1, AI8=1), 1, 0)","v":1}]
[20210331,90,23643,"COMMERCIAL BANK & TRUST COMPANY",1,247993,"AR","FED","SM",0,13,1098198,1098198,1,1,0,22547,22547,0,239690,0,null,null,null,9.41,1763,4008,135656,0,83266,0,0,0,{"$f":"IFERROR(VLOOKUP(B9, Info!$P$7:$P$1000, 1, FALSE)/VLOOKUP(B9, Info!$P$7:$P$1000, 1, FALSE), 0)","v":1},{"$f":"IFERROR(VLOOKUP(B9, Info!$Q$7:$Q$1000, 1, FALSE)/VLOOKUP(B9, Info!$Q$7:$Q$1000, 1, FALSE), 0)","v":0},{"$f":"IF(OR(P9=1, AH9=1, AI9=1), 1, 0)","v":1}]
[20210331,94,843542,"FIRST STATE BANK OF WARREN",1,119983,"AR","FED","SM",0,13,1097463,1097463,1,1,0,12554,12554,0,120263,0,null,null,null,10.44,1628,6511,51495,0,56309,0,0,0,{"$f":"IFERROR(VLOOKUP(B10, Info!$P$7:$P$1000, 1, FALSE)/VLOOKUP(B10, Info!$P$7:$P$1000, 1, FALSE), 0)","v":1},{"$f":"IFERROR(VLOOKUP(B10, Info!$Q$7:$Q$1000, 1, FALSE)/VLOOKUP(B10, Info!$Q$7:$Q$1000, 1, FALSE), 0)","v":0},{"$f":"IF(OR(P10=1, AH10=1, AI10=1), 1, 0)","v":1}]
[20210331,252,365745,"PINNACLE BANK",1,238311,"IA","FED","SM",0,11,3916317,3916317,0,0,1,35960,35960,37793,223569,171949,20.91,20.91,21.98,16.079999999999998,2766,758,149013,1228,48631,0,0,5037,{"$f":"IFERROR(VLOOKUP(B11, Info!$P$7:$P$1000, 1, FALSE)/VLOOKUP(B11, Info!$P$7:$P$1000, 1, FALSE), 0)","v":0},{"$f":"IFERROR(VLOOKUP(B11, Info!$Q$7:$Q$1000, 1, FALSE)/VLOOKUP(B11, Info!$Q$7:$Q$1000, 1, FALSE), 0)","v":0},{"$f":"IF(OR(P11=1, AH11=1, AI11=1), 1, 0)","v":1}]
[20210331,306,860334,"BANK OF ZACHARY",1,325267,"LA","FDIC","NM",0,13,1086056,1086056,0,0,0,25400,25400,27407,322123,160294,15.85,15.85,17.100000000000001,7.89,3917,759,191069,0,117525,0,0,0,{"$f":"IFERROR(VLOOKUP(B12, Info!$P$7:$P$1000, 1, FALSE)/VLOOKUP(B12, Info!$P$7:$P$1000, 1, FALSE), 0)","v":1},{"$f":"IFERROR(VLOOKUP(B12, Info!$Q$7:$Q$1000, 1, FALSE)/VLOOKUP(B12, Info!$Q$7:$Q$1000, 1, FALSE), 0)","v":0},{"$f":"IF(OR(P12=1, AH12=1, AI12=1), 1, 0)","v":1}]
[20210331,307,535034,"LANDMARK BANK",1,161189,"LA","FDIC","NM",0,13,1085460,1085460,1,1,0,14823,14823,0,157153,0,null,null,null,9.43,4687,1829,102366,195,42260,0,0,0,{"$f":"IFERROR(VLOOKUP(B13, Info!$P$7:$P$1000, 1, FALSE)/VLOOKUP(B13, Info!$P$7:$P$1000, 1, FALSE), 0)","v":1},{"$f":"IFERROR(VLOOKUP(B13, Info!$Q$7:$Q$1000, 1, FALSE)/VLOOKUP(B13, Info!$Q$7:$Q$1000, 1, FALSE), 0)","v":0},{"$f":"IF(OR(P13=1, AH13=1, AI13=1), 1, 0)","v":1}]
[20210331,321,725741,"HOLMES COUNTY BANK & TRUST COMPANY",1,139978,"MS","FDIC","NM",0,13,1119057,1119057,0,1,0,16580,16580,17324,138316,59525,27.85,27.85,29.1,11.99,5598,7670,40365,817,57499,0,0,0,{"$f":"IFERROR(VLOOKUP(B14, Info!$P$7:$P$1000, 1, FALSE)/VLOOKUP(B14, Info!$P$7:$P$1000, 1, FALSE), 0)","v":1},{"$f":"IFERROR(VLOOKUP(B14, Info!$Q$7:$Q$1000, 1, FALSE)/VLOOKUP(B14, Info!$Q$7:$Q$1000, 1, FALSE), 0)","v":0},{"$f":"IF(OR(P14=1, AH14=1, AI14=1), 1, 0)","v":1}]
[20210331,324,514132,"CITIZENS BANK",1,483472,"MS","FDIC","NM",0,13,1246681,1246681,0,1,0,46817,46817,50526,479004,296147,15.81,15.81,17.059999999999999,9.77,6532,99076,310315,0,41848,0,0,0,{"$f":"IFERROR(VLOOKUP(B15, Info!$P$7:$P$1000, 1, FALSE)/VLOOKUP(B15, Info!$P$7:$P$1000, 1, FALSE), 0)","v":1},{"$f":"IFERROR(VLOOKUP(B15, Info!$Q$7:$Q$1000, 1, FALSE)/VLOOKUP(B15, Info!$Q$7:$Q$1000, 1, FALSE), 0)","v":0},{"$f":"IF(OR(P15=1, AH15=1, AI15=1), 1, 0)","v":1}]
[20210331,327,579636,"MERCHANTS AND PLANTERS BANK",1,117268,"MS","FDIC","NM",0,13,null,null,1,0,0,10446,10446,0,112055,0,null,null,null,9.32,4067,24991,57884,351,23271,0,0,448,{"$f":"IFERROR(VLOOKUP(B16, Info!$P$7:$P$1000, 1, FALSE)/VLOOKUP(B16, Info!$P$7:$P$1000, 1, FALSE), 0)","v":1},{"$f":"IFERROR(VLOOKUP(B16, Info!$Q$7:$Q$1000, 1, FALSE)/VLOOKUP(B16, Info!$Q$7:$Q$1000, 1, FALSE), 0)","v":0},{"$f":"IF(OR(P16=1, AH16=1, AI16=1), 1, 0)","v":1}]
[20210331,855,376237,"MERCHANTS & FARMERS BANK OF GREENE COUNTY, ALABAMA",1,92309,"AL","FDIC","NM",0,5,2111432,2111432,1,1,0,7684,7684,0,91338,0,null,null,null,8.41,3188,2724,46717,0,25893,0,0,0,{"$f":"IFERROR(VLOOKUP(B17, Info!$P$7:$P$1000, 1, FALSE)/VLOOKUP(B17, Info!$P$7:$P$1000, 1, FALSE), 0)","v":1},{"$f":"IFERROR(VLOOKUP(B17, Info!$Q$7:$Q$1000, 1, FALSE)/VLOOKUP(B17, Info!$Q$7:$Q$1000, 1, FALSE), 0)","v":0},{"$f":"IF(OR(P17=1, AH17=1, AI17=1), 1, 0)","v":1}]
[20210331,1027,33147,"FARMERS BANK AND TRUST COMPANY",1,316514,"AR","FED","SM",0,13,1247615,1247615,0,1,0,29519,29519,32176,318615,210915,14,14,15.26,9.26,6119,48465,214690,0,14271,0,0,0,{"$f":"IFERROR(VLOOKUP(B18, Info!$P$7:$P$1000, 1, FALSE)/VLOOKUP(B18, Info!$P$7:$P$1000, 1, FALSE), 0)","v":1},{"$f":"IFERROR(VLOOKUP(B18, Info!$Q$7:$Q$1000, 1, FALSE)/VLOOKUP(B18, Info!$Q$7:$Q$1000, 1, FALSE), 0)","v":0},{"$f":"IF(OR(P18=1, AH18=1, AI18=1), 1, 0)","v":1}]
[20210331,1028,314444,"FBT BANK & MORTGAGE",1,204340,"AR","FED","SM",0,13,1099092,1099092,1,1,0,21718,21718,0,200347,0,null,null,null,10.84,35114,549,99919,0,62026,0,0,0,{"$f":"IFERROR(VLOOKUP(B19, Info!$P$7:$P$1000, 1, FALSE)/VLOOKUP(B19, Info!$P$7:$P$1000, 1, FALSE), 0)","v":1},{"$f":"IFERROR(VLOOKUP(B19, Info!$Q$7:$Q$1000, 1, FALSE)/VLOOKUP(B19, Info!$Q$7:$Q$1000, 1, FALSE), 0)","v":0},{"$f":"IF(OR(P19=1, AH19=1, AI19=1), 1, 0)","v":1}]
[20210331,1294,100843,"FNBC BANK",1,601205,"AR","FED","SM",0,13,1099690,1099690,0,1,0,59093,59093,64398,579791,420826,14.04,14.04,15.3,10.19,8726,20111,398077,4335,144287,0,0,0,{"$f":"IFERROR(VLOOKUP(B20, Info!$P$7:$P$1000, 1, FALSE)/VLOOKUP(B20, Info!$P$7:$P$1000, 1, FALSE), 0)","v":1},{"$f":"IFERROR(VLOOKUP(B20, Info!$Q$7:$Q$1000, 1, FALSE)/VLOOKUP(B20, Info!$Q$7:$Q$1000, 1, FALSE), 0)","v":0},{"$f":"IF(OR(P20=1, AH20=1, AI20=1), 1, 0)","v":1}]
[20210331,1373,684455,"BOM BANK",1,624645,"LA","FDIC","NM",0,13,3203138,3203138,1,1,0,57235,57235,0,611008,0,null,null,null,9.3699999999999992,10910,5247,541897,0,16263,0,0,2188,{"$f":"IFERROR(VLOOKUP(B21, Info!$P$7:$P$1000, 1, FALSE)/VLOOKUP(B21, Info!$P$7:$P$1000, 1, FALSE), 0)","v":1},{"$f":"IFERROR(VLOOKUP(B21, Info!$Q$7:$Q$1000, 1, FALSE)/VLOOKUP(B21, Info!$Q$7:$Q$1000, 1, FALSE), 0)","v":0},{"$f":"IF(OR(P21=1, AH21=1, AI21=1), 1, 0)","v":1}]
[20210331,1417,980951,"WOODLANDS NATIONAL BANK",1,320779,"MN","OCC","N",0,11,2359823,2359823,0,0,1,28166,28166,29972,309039,143983,19.559999999999999,19.559999999999999,20.82,9.11,4244,52693,171079,0,85487,0,0,2285,{"$f":"IFERROR(VLOOKUP(B22, Info!$P$7:$P$1000, 1, FALSE)/VLOOKUP(B22, Info!$P$7:$P$1000, 1, FALSE), 0)","v":0},{"$f":"IFERROR(VLOOKUP(B22, Info!$Q$7:$Q$1000, 1, FALSE)/VLOOKUP(B22, Info!$Q$7:$Q$1000, 1, FALSE), 0)","v":0},{"$f":"IF(OR(P22=1, AH22=1, AI22=1), 1, 0)","v":1}]
[20210331,1528,852544,"SOUTHERN BANCORP BANK",1,1760967,"AR","FED","SM",0,13,1248939,1248939,0,0,0,147694,147694,162001,1660990,1141949,12.93,12.93,14.19,8.89,36761,35086,1173151,107539,291794,0,0,37257,{"$f":"IFERROR(VLOOKUP(B23, Info!$P$7:$P$1000, 1, FALSE)/VLOOKUP(B23, Info!$P$7:$P$1000, 1, FALSE), 0)","v":1},{"$f":"IFERROR(VLOOKUP(B23, Info!$Q$7:$Q$1000, 1, FALSE)/VLOOKUP(B23, Info!$Q$7:$Q$1000, 1, FALSE), 0)","v":0},{"$f":"IF(OR(P23=1, AH23=1, AI23=1), 1, 0)","v":1}]
[20210331,1705,714437,"MOUNTAIN VALLEY BANK",1,128932,"TN","FDIC","NM",0,13,1134751,1134751,0,0,0,10247,10247,11073,121696,65989,15.53,15.53,16.78,8.42,1650,23033,78617,0,21534,0,0,0,{"$f":"IFERROR(VLOOKUP(B24, Info!$P$7:$P$1000, 1, FALSE)/VLOOKUP(B24, Info!$P$7:$P$1000, 1, FALSE), 0)","v":1},{"$f":"IFERROR(VLOOKUP(B24, Info!$Q$7:$Q$1000, 1, FALSE)/VLOOKUP(B24, Info!$Q$7:$Q$1000, 1, FALSE), 0)","v":0},{"$f":"IF(OR(P24=1, AH24=1, AI24=1), 1, 0)","v":1}]
[20210331,1753,22048,"UNION BANK & TRUST COMPANY",1,260279,"AR","FDIC","NM",0,13,1098880,1098880,0,1,0,24817,24817,27228,255327,192716,12.88,12.88,14.13,9.7200000000000006,5279,16037,187335,0,40938,0,0,0,{"$f":"IFERROR(VLOOKUP(B25, Info!$P$7:$P$1000, 1, FALSE)/VLOOKUP(B25, Info!$P$7:$P$1000, 1, FALSE), 0)","v":1},{"$f":"IFERROR(VLOOKUP(B25, Info!$Q$7:$Q$1000, 1, FALSE)/VLOOKUP(B25, Info!$Q$7:$Q$1000, 1, FALSE), 0)","v":0},{"$f":"IF(OR(P25=1, AH25=1, AI25=1), 1, 0)","v":1}]
[20210331,2320,539452,"CARSON COMMUNITY BANK",1,172299,"OK","FDIC","NM",0,13,2606321,2606321,1,1,1,15080,15080,0,163004,0,null,null,null,9.25,4580,10,101981,0,59331,0,0,0,{"$f":"IFERROR(VLOOKUP(B26, Info!$P$7:$P$1000, 1, FALSE)/VLOOKUP(B26, Info!$P$7:$P$1000, 1, FALSE), 0)","v":0},{"$f":"IFERROR(VLOOKUP(B26, Info!$Q$7:$Q$1000, 1, FALSE)/VLOOKUP(B26, Info!$Q$7:$Q$1000, 1, FALSE), 0)","v":0},{"$f":"IF(OR(P26=1, AH26=1, AI26=1), 1, 0)","v":1}]
[20210331,2327,815754,"BANK OF CHEROKEE COUNTY",1,148347,"OK","FED","SM",0,13,2355870,2011952,0,0,1,11456,11456,12500,145079,92716,12.36,12.36,13.48,7.9,2260,22145,103518,0,2718,0,0,32,{"$f":"IFERROR(VLOOKUP(B27, Info!$P$7:$P$1000, 1, FALSE)/VLOOKUP(B27, Info!$P$7:$P$1000, 1, FALSE), 0)","v":1},{"$f":"IFERROR(VLOOKUP(B27, Info!$Q$7:$Q$1000, 1, FALSE)/VLOOKUP(B27, Info!$Q$7:$Q$1000, 1, FALSE), 0)","v":0},{"$f":"IF(OR(P27=1, AH27=1, AI27=1), 1, 0)","v":1}]
[20210331,2380,541857,"CARROLL BANK AND TRUST",1,367868,"TN","FED","SM",0,13,1848825,1848825,1,0,0,32283,32283,0,361309,0,null,null,null,8.94,16173,33542,240458,0,50698,0,0,755,{"$f":"IFERROR(VLOOKUP(B28, Info!$P$7:$P$1000, 1, FALSE)/VLOOKUP(B28, Info!$P$7:$P$1000, 1, FALSE), 0)","v":1},{"$f":"IFERROR(VLOOKUP(B28, Info!$Q$7:$Q$1000, 1, FALSE)/VLOOKUP(B28, Info!$Q$7:$Q$1000, 1, FALSE), 0)","v":0},{"$f":"IF(OR(P28=1, AH28=1, AI28=1), 1, 0)","v":1}]
[20210331,2448,294827,"PIONEER COMMUNITY BANK, INC.",1,142376,"WV","FDIC","NM",0,5,2356514,2356514,1,0,0,17463,17463,0,138310,0,null,null,null,12.63,3323,19913,95842,0,12989,0,0,0,{"$f":"IFERROR(VLOOKUP(B29, Info!$P$7:$P$1000, 1, FALSE)/VLOOKUP(B29, Info!$P$7:$P$1000, 1, FALSE), 0)","v":1},{"$f":"IFERROR(VLOOKUP(B29, Info!$Q$7:$Q$1000, 1, FALSE)/VLOOKUP(B29, Info!$Q$7:$Q$1000, 1, FALSE), 0)","v":0},{"$f":"IF(OR(P29=1, AH29=1, AI29=1), 1, 0)","v":1}]
[20210331,2779,670430,"THE FIRST NATIONAL BANK AND TRUST",1,194527,"AL","OCC","N",0,5,1141302,1141302,1,1,0,19736,19736,0,189716,0,null,null,null,10.4,2892,7619,114928,0,55237,0,0,0,{"$f":"IFERROR(VLOOKUP(B30, Info!$P$7:$P$1000, 1, FALSE)/VLOOKUP(B30, Info!$P$7:$P$1000, 1, FALSE), 0)","v":1},{"$f":"IFERROR(VLOOKUP(B30, Info!$Q$7:$Q$1000, 1, FALSE)/VLOOKUP(B30, Info!$Q$7:$Q$1000, 1, FALSE), 0)","v":0},{"$f":"IF(OR(P30=1, AH30=1, AI30=1), 1, 0)","v":1}]
[20210331,2828,244037,"FRIEND BANK",1,173495,"AL","FDIC","NM",0,5,2848653,2848653,1,1,0,14423,14423,0,167278,0,null,null,null,8.6199999999999992,5764,49694,98036,0,16357,39,0,136,{"$f":"IFERROR(VLOOKUP(B31, Info!$P$7:$P$1000, 1, FALSE)/VLOOKUP(B31, Info!$P$7:$P$1000, 1, FALSE), 0)","v":1},{"$f":"IFERROR(VLOOKUP(B31, Info!$Q$7:$Q$1000, 1, FALSE)/VLOOKUP(B31, Info!$Q$7:$Q$1000, 1, FALSE), 0)","v":0},{"$f":"IF(OR(P31=1, AH31=1, AI31=1), 1, 0)","v":1}]
[20210331,3337,497954,"TEXAS NATIONAL BANK",1,469318,"TX","OCC","N",0,13,3305434,3305434,0,0,1,40806,40806,44263,439632,275614,14.81,14.81,16.059999999999999,9.2799999999999994,12005,20214,340717,0,54003,0,0,0,{"$f":"IFERROR(VLOOKUP(B32, Info!$P$7:$P$1000, 1, FALSE)/VLOOKUP(B32, Info!$P$7:$P$1000, 1, FALSE), 0)","v":1},{"$f":"IFERROR(VLOOKUP(B32, Info!$Q$7:$Q$1000, 1, FALSE)/VLOOKUP(B32, Info!$Q$7:$Q$1000, 1, FALSE), 0)","v":0},{"$f":"IF(OR(P32=1, AH32=1, AI32=1), 1, 0)","v":1}]
[20210331,4033,251352,"BANCCENTRAL, NATIONAL ASSOCIATION",1,576023,"OK","OCC","N",0,13,2107789,2107789,0,1,0,41958,41958,47540,559326,445842,9.41,9.41,10.66,7.5,12137,49245,318211,52,152306,822,0,3589,{"$f":"IFERROR(VLOOKUP(B33, Info!$P$7:$P$1000, 1, FALSE)/VLOOKUP(B33, Info!$P$7:$P$1000, 1, FALSE), 0)","v":0},{"$f":"IFERROR(VLOOKUP(B33, Info!$Q$7:$Q$1000, 1, FALSE)/VLOOKUP(B33, Info!$Q$7:$Q$1000, 1, FALSE), 0)","v":1},{"$f":"IF(OR(P33=1, AH33=1, AI33=1), 1, 0)","v":1}]
[20210331,4051,146056,"ALLNATIONS BANK",1,46727,"OK","FED","SM",0,13,3176559,3176559,1,0,1,4805,4805,0,45609,0,null,null,null,10.54,1228,467,23256,0,11903,508,0,0,{"$f":"IFERROR(VLOOKUP(B34, Info!$P$7:$P$1000, 1, FALSE)/VLOOKUP(B34, Info!$P$7:$P$1000, 1, FALSE), 0)","v":0},{"$f":"IFERROR(VLOOKUP(B34, Info!$Q$7:$Q$1000, 1, FALSE)/VLOOKUP(B34, Info!$Q$7:$Q$1000, 1, FALSE), 0)","v":0},{"$f":"IF(OR(P34=1, AH34=1, AI34=1), 1, 0)","v":1}]
[20210331,4161,310950,"FIRST NATIONAL BANK IN OKEENE",1,83792,"OK","OCC","N",0,13,3822687,2942850,0,1,0,13677,13677,14322,78271,51337,26.64,26.64,27.9,17.47,644,2968,40311,0,28798,0,0,0,{"$f":"IFERROR(VLOOKUP(B35, Info!$P$7:$P$1000, 1, FALSE)/VLOOKUP(B35, Info!$P$7:$P$1000, 1, FALSE), 0)","v":0},{"$f":"IFERROR(VLOOKUP(B35, Info!$Q$7:$Q$1000, 1, FALSE)/VLOOKUP(B35, Info!$Q$7:$Q$1000, 1, FALSE), 0)","v":1},{"$f":"IF(OR(P35=1, AH35=1, AI35=1), 1, 0)","v":1}]
[20210331,4477,818540,"THE FIRST NATIONAL BANK OF MANNING",1,76176,"IA","OCC","N",0,11,1491838,1491838,0,0,0,12249,12249,12704,76675,36123,33.909999999999997,33.909999999999997,35.17,15.98,2920,23463,35088,0,14418,0,0,0,{"$f":"IFERROR(VLOOKUP(B36, Info!$P$7:$P$1000, 1, FALSE)/VLOOKUP(B36, Info!$P$7:$P$1000, 1, FALSE), 0)","v":0},{"$f":"IFERROR(VLOOKUP(B36, Info!$Q$7:$Q$1000, 1, FALSE)/VLOOKUP(B36, Info!$Q$7:$Q$1000, 1, FALSE), 0)","v":1},{"$f":"IF(OR(P36=1, AH36=1, AI36=1), 1, 0)","v":1}]
[20210331,4993,69333,"THE CITIZENS NATIONAL BANK OF MERIDIAN",1,1679675,"MS","OCC","N",0,13,3186576,3186576,0,1,0,175100,175100,189786,1622293,1206333,14.52,14.52,15.73,10.79,23305,193460,1040437,100680,264313,0,0,0,{"$f":"IFERROR(VLOOKUP(B37, Info!$P$7:$P$1000, 1, FALSE)/VLOOKUP(B37, Info!$P$7:$P$1000, 1, FALSE), 0)","v":1},{"$f":"IFERROR(VLOOKUP(B37, Info!$Q$7:$Q$1000, 1, FALSE)/VLOOKUP(B37, Info!$Q$7:$Q$1000, 1, FALSE), 0)","v":0},{"$f":"IF(OR(P37=1, AH37=1, AI37=1), 1, 0)","v":1}]
[20210331,5005,590640,"FNB OXFORD BANK",1,456602,"MS","FED","SM",0,13,1097070,1097070,1,0,0,43132,43132,0,448115,0,null,null,null,9.6300000000000008,17142,6598,229871,0,180076,0,0,0,{"$f":"IFERROR(VLOOKUP(B38, Info!$P$7:$P$1000, 1, FALSE)/VLOOKUP(B38, Info!$P$7:$P$1000, 1, FALSE), 0)","v":1},{"$f":"IFERROR(VLOOKUP(B38, Info!$Q$7:$Q$1000, 1, FALSE)/VLOOKUP(B38, Info!$Q$7:$Q$1000, 1, FALSE), 0)","v":0},{"$f":"IF(OR(P38=1, AH38=1, AI38=1), 1, 0)","v":1}]
[20210331,5410,3252,"THE FIRST NATIONAL BANK OF GORDON",1,257564,"NE","OCC","N",0,11,1050794,1050794,0,1,0,29628,29628,31189,237912,122339,24.22,24.22,25.49,12.45,12536,4489,103952,0,121616,0,0,0,{"$f":"IFERROR(VLOOKUP(B39, Info!$P$7:$P$1000, 1, FALSE)/VLOOKUP(B39, Info!$P$7:$P$1000, 1, FALSE), 0)","v":0},{"$f":"IFERROR(VLOOKUP(B39, Info!$Q$7:$Q$1000, 1, FALSE)/VLOOKUP(B39, Info!$Q$7:$Q$1000, 1, FALSE), 0)","v":1},{"$f":"IF(OR(P39=1, AH39=1, AI39=1), 1, 0)","v":1}]
[20210331,5520,521064,"THE SANTA ANNA NATIONAL BANK",1,53242,"TX","OCC","N",0,13,null,null,1,0,0,5953,5953,0,53062,0,null,null,null,11.22,1208,792,28938,0,20592,0,0,0,{"$f":"IFERROR(VLOOKUP(B40, Info!$P$7:$P$1000, 1, FALSE)/VLOOKUP(B40, Info!$P$7:$P$1000, 1, FALSE), 0)","v":0},{"$f":"IFERROR(VLOOKUP(B40, Info!$Q$7:$Q$1000, 1, FALSE)/VLOOKUP(B40, Info!$Q$7:$Q$1000, 1, FALSE), 0)","v":1},{"$f":"IF(OR(P40=1, AH40=1, AI40=1), 1, 0)","v":1}]
[20210331,5628,173342,"PIGGOTT STATE BANK",1,115234,"AR","FED","SM",0,13,1098321,1098321,0,1,0,9074,9074,9726,112844,51861,17.5,17.5,18.75,8.0399999999999991,2674,28998,47127,0,35164,0,0,0,{"$f":"IFERROR(VLOOKUP(B41, Info!$P$7:$P$1000, 1, FALSE)/VLOOKUP(B41, Info!$P$7:$P$1000, 1, FALSE), 0)","v":1},{"$f":"IFERROR(VLOOKUP(B41, Info!$Q$7:$Q$1000, 1, FALSE)/VLOOKUP(B41, Info!$Q$7:$Q$1000, 1, FALSE), 0)","v":0},{"$f":"IF(OR(P41=1, AH41=1, AI41=1), 1, 0)","v":1}]
[20210331,5902,919344,"BANK OF OKOLONA",1,236386,"MS","FDIC","NM",0,13,2744326,2744326,1,1,0,21843,21843,0,231356,0,null,null,null,9.44,4622,2671,126647,0,61317,0,0,0,{"$f":"IFERROR(VLOOKUP(B42, Info!$P$7:$P$1000, 1, FALSE)/VLOOKUP(B42, Info!$P$7:$P$1000, 1, FALSE), 0)","v":1},{"$f":"IFERROR(VLOOKUP(B42, Info!$Q$7:$Q$1000, 1, FALSE)/VLOOKUP(B42, Info!$Q$7:$Q$1000, 1, FALSE), 0)","v":0},{"$f":"IF(OR(P42=1, AH42=1, AI42=1), 1, 0)","v":1}]
[20210331,5903,121642,"BANKPLUS",1,4940100,"MS","FDIC","NM",0,13,1097306,1097306,0,0,0,398495,398495,438536,4795032,3498848,11.39,11.39,12.53,8.31,98920,483155,3425285,90818,572888,0,0,7992,{"$f":"IFERROR(VLOOKUP(B43, Info!$P$7:$P$1000, 1, FALSE)/VLOOKUP(B43, Info!$P$7:$P$1000, 1, FALSE), 0)","v":1},{"$f":"IFERROR(VLOOKUP(B43, Info!$Q$7:$Q$1000, 1, FALSE)/VLOOKUP(B43, Info!$Q$7:$Q$1000, 1, FALSE), 0)","v":0},{"$f":"IF(OR(P43=1, AH43=1, AI43=1), 1, 0)","v":1}]
[20210331,5907,875936,"FIRST BANK",1,637450,"MS","FDIC","NM",0,13,1082692,1082692,0,1,0,58641,58641,63334,608915,374792,15.65,15.65,16.899999999999999,9.6300000000000008,12653,77168,355927,40270,6483,0,0,0,{"$f":"IFERROR(VLOOKUP(B44, Info!$P$7:$P$1000, 1, FALSE)/VLOOKUP(B44, Info!$P$7:$P$1000, 1, FALSE), 0)","v":1},{"$f":"IFERROR(VLOOKUP(B44, Info!$Q$7:$Q$1000, 1, FALSE)/VLOOKUP(B44, Info!$Q$7:$Q$1000, 1, FALSE), 0)","v":0},{"$f":"IF(OR(P44=1, AH44=1, AI44=1), 1, 0)","v":1}]
[20210331,6101,66154,"DECATUR COUNTY BANK",1,188124,"TN","FED","SM",0,13,2201883,2201883,0,1,0,17207,17207,18598,182512,134295,12.81,12.81,13.85,9.43,12885,1534,135203,0,23878,0,0,0,{"$f":"IFERROR(VLOOKUP(B45, Info!$P$7:$P$1000, 1, FALSE)/VLOOKUP(B45, Info!$P$7:$P$1000, 1, FALSE), 0)","v":1},{"$f":"IFERROR(VLOOKUP(B45, Info!$Q$7:$Q$1000, 1, FALSE)/VLOOKUP(B45, Info!$Q$7:$Q$1000, 1, FALSE), 0)","v":0},{"$f":"IF(OR(P45=1, AH45=1, AI45=1), 1, 0)","v":1}]
[20210331,7590,977616,"THE NATIONAL BANK OF MALVERN",1,187146,"PA","OCC","N",0,2,2409755,2409755,1,0,0,24315,24315,0,176843,0,null,null,null,13.75,4268,16093,138727,5678,19712,0,0,0,{"$f":"IFERROR(VLOOKUP(B46, Info!$P$7:$P$1000, 1, FALSE)/VLOOKUP(B46, Info!$P$7:$P$1000, 1, FALSE), 0)","v":0},{"$f":"IFERROR(VLOOKUP(B46, Info!$Q$7:$Q$1000, 1, FALSE)/VLOOKUP(B46, Info!$Q$7:$Q$1000, 1, FALSE), 0)","v":1},{"$f":"IF(OR(P46=1, AH46=1, AI46=1), 1, 0)","v":1}]
[20210331,8033,680130,"CITIZENS TRUST BANK",1,601255,"GA","FED","SM",0,5,1078958,1078958,0,0,1,49077,49077,52146,577709,294532,16.66,16.66,17.7,8.5,2132,178625,295940,0,64140,0,0,362,{"$f":"IFERROR(VLOOKUP(B47, Info!$P$7:$P$1000, 1, FALSE)/VLOOKUP(B47, Info!$P$7:$P$1000, 1, FALSE), 0)","v":1},{"$f":"IFERROR(VLOOKUP(B47, Info!$Q$7:$Q$1000, 1, FALSE)/VLOOKUP(B47, Info!$Q$7:$Q$1000, 1, FALSE), 0)","v":0},{"$f":"IF(OR(P47=1, AH47=1, AI47=1), 1, 0)","v":1}]
[20210331,8140,178356,"COLFAX BANKING COMPANY",1,145425,"LA","FDIC","NM",0,13,2948254,2948254,1,1,0,12179,12179,0,140960,0,null,null,null,8.64,3441,1341,61499,0,70136,0,0,0,{"$f":"IFERROR(VLOOKUP(B48, Info!$P$7:$P$1000, 1, FALSE)/VLOOKUP(B48, Info!$P$7:$P$1000, 1, FALSE), 0)","v":1},{"$f":"IFERROR(VLOOKUP(B48, Info!$Q$7:$Q$1000, 1, FALSE)/VLOOKUP(B48, Info!$Q$7:$Q$1000, 1, FALSE), 0)","v":0},{"$f":"IF(OR(P48=1, AH48=1, AI48=1), 1, 0)","v":1}]
[20210331,8231,398837,"COPIAH BANK",1,274447,"MS","FED","SM",0,13,3319972,3319972,1,0,0,24903,24903,0,272454,0,null,null,null,9.14,6478,18524,171441,30011,32778,0,0,0,{"$f":"IFERROR(VLOOKUP(B49, Info!$P$7:$P$1000, 1, FALSE)/VLOOKUP(B49, Info!$P$7:$P$1000, 1, FALSE), 0)","v":1},{"$f":"IFERROR(VLOOKUP(B49, Info!$Q$7:$Q$1000, 1, FALSE)/VLOOKUP(B49, Info!$Q$7:$Q$1000, 1, FALSE), 0)","v":0},{"$f":"IF(OR(P49=1, AH49=1, AI49=1), 1, 0)","v":1}]
[20210331,8232,835743,"BANK OF HOLLY SPRINGS",1,369881,"MS","FDIC","NM",0,13,2590644,2590644,1,1,0,35212,35212,0,355309,0,null,null,null,9.91,6889,58831,237242,301,45251,0,0,4701,{"$f":"IFERROR(VLOOKUP(B50, Info!$P$7:$P$1000, 1, FALSE)/VLOOKUP(B50, Info!$P$7:$P$1000, 1, FALSE), 0)","v":1},{"$f":"IFERROR(VLOOKUP(B50, Info!$Q$7:$Q$1000, 1, FALSE)/VLOOKUP(B50, Info!$Q$7:$Q$1000, 1, FALSE), 0)","v":0},{"$f":"IF(OR(P50=1, AH50=1, AI50=1), 1, 0)","v":1}]
[20210331,8234,573335,"RIVERHILLS BANK",1,395537,"MS","FDIC","NM",0,13,1082786,1082786,1,1,0,39287,39287,0,372734,0,null,null,null,10.54,6867,32509,180645,6366,160455,0,0,0,{"$f":"IFERROR(VLOOKUP(B51, Info!$P$7:$P$1000, 1, FALSE)/VLOOKUP(B51, Info!$P$7:$P$1000, 1, FALSE), 0)","v":1},{"$f":"IFERROR(VLOOKUP(B51, Info!$Q$7:$Q$1000, 1, FALSE)/VLOOKUP(B51, Info!$Q$7:$Q$1000, 1, FALSE), 0)","v":0},{"$f":"IF(OR(P51=1, AH51=1, AI51=1), 1, 0)","v":1}]
[20210331,8235,972648,"PLANTERS BANK & TRUST COMPANY",1,1348414,"MS","FDIC","NM",0,13,1096484,1096484,0,0,0,114312,114312,119086,1306939,705961,16.190000000000001,16.190000000000001,16.87,8.75,19360,108977,582902,19349,540515,0,0,5393,{"$f":"IFERROR(VLOOKUP(B52, Info!$P$7:$P$1000, 1, FALSE)/VLOOKUP(B52, Info!$P$7:$P$1000, 1, FALSE), 0)","v":1},{"$f":"IFERROR(VLOOKUP(B52, Info!$Q$7:$Q$1000, 1, FALSE)/VLOOKUP(B52, Info!$Q$7:$Q$1000, 1, FALSE), 0)","v":0},{"$f":"IF(OR(P52=1, AH52=1, AI52=1), 1, 0)","v":1}]
[20210331,8243,31835,"BANK OF ANGUILLA",1,170814,"MS","FDIC","NM",0,13,3664216,3664216,1,0,0,16045,16045,0,171867,0,null,null,null,9.34,4139,4224,77848,2210,32022,0,0,0,{"$f":"IFERROR(VLOOKUP(B53, Info!$P$7:$P$1000, 1, FALSE)/VLOOKUP(B53, Info!$P$7:$P$1000, 1, FALSE), 0)","v":1},{"$f":"IFERROR(VLOOKUP(B53, Info!$Q$7:$Q$1000, 1, FALSE)/VLOOKUP(B53, Info!$Q$7:$Q$1000, 1, FALSE), 0)","v":0},{"$f":"IF(OR(P53=1, AH53=1, AI53=1), 1, 0)","v":1}]
[20210331,8296,904359,"CENTURY BANK OF THE OZARKS",1,222441,"MO","FED","SM",0,11,1095469,1095469,1,0,0,17884,17884,0,210013,0,null,null,null,8.52,3530,37017,167549,0,2490,0,0,634,{"$f":"IFERROR(VLOOKUP(B54, Info!$P$7:$P$1000, 1, FALSE)/VLOOKUP(B54, Info!$P$7:$P$1000, 1, FALSE), 0)","v":1},{"$f":"IFERROR(VLOOKUP(B54, Info!$Q$7:$Q$1000, 1, FALSE)/VLOOKUP(B54, Info!$Q$7:$Q$1000, 1, FALSE), 0)","v":0},{"$f":"IF(OR(P54=1, AH54=1, AI54=1), 1, 0)","v":1}]
[20210331,8439,531250,"CENTENNIAL BANK",1,656796,"TN","FDIC","NM",0,13,1135806,1135806,0,0,0,62955,62955,68722,639619,460926,13.66,13.66,14.91,9.84,36716,103538,425992,0,38467,0,0,8069,{"$f":"IFERROR(VLOOKUP(B55, Info!$P$7:$P$1000, 1, FALSE)/VLOOKUP(B55, Info!$P$7:$P$1000, 1, FALSE), 0)","v":1},{"$f":"IFERROR(VLOOKUP(B55, Info!$Q$7:$Q$1000, 1, FALSE)/VLOOKUP(B55, Info!$Q$7:$Q$1000, 1, FALSE), 0)","v":0},{"$f":"IF(OR(P55=1, AH55=1, AI55=1), 1, 0)","v":1}]
[20210331,8527,819556,"CONCORDIA BANK & TRUST COMPANY",1,616789,"LA","FDIC","NM",0,13,2557414,2557414,1,1,0,63260,63260,0,602637,0,null,null,null,10.5,9363,52484,305801,33505,190301,2013,0,1397,{"$f":"IFERROR(VLOOKUP(B56, Info!$P$7:$P$1000, 1, FALSE)/VLOOKUP(B56, Info!$P$7:$P$1000, 1, FALSE), 0)","v":1},{"$f":"IFERROR(VLOOKUP(B56, Info!$Q$7:$Q$1000, 1, FALSE)/VLOOKUP(B56, Info!$Q$7:$Q$1000, 1, FALSE), 0)","v":0},{"$f":"IF(OR(P56=1, AH56=1, AI56=1), 1, 0)","v":1}]
[20210331,8533,134455,"TENSAS STATE BANK",1,164616,"LA","FDIC","NM",0,13,1109487,1109487,1,1,0,21358,21358,0,169884,0,null,null,null,12.57,2425,19692,85917,0,50032,0,0,0,{"$f":"IFERROR(VLOOKUP(B57, Info!$P$7:$P$1000, 1, FALSE)/VLOOKUP(B57, Info!$P$7:$P$1000, 1, FALSE), 0)","v":1},{"$f":"IFERROR(VLOOKUP(B57, Info!$Q$7:$Q$1000, 1, FALSE)/VLOOKUP(B57, Info!$Q$7:$Q$1000, 1, FALSE), 0)","v":0},{"$f":"IF(OR(P57=1, AH57=1, AI57=1), 1, 0)","v":1}]
[20210331,8552,101738,"GREAT SOUTHERN BANK",1,347079,"MS","FED","SM",0,13,1080568,1080568,1,0,0,28807,28807,0,336325,0,null,null,null,8.57,7574,23909,125685,71295,109537,0,0,0,{"$f":"IFERROR(VLOOKUP(B58, Info!$P$7:$P$1000, 1, FALSE)/VLOOKUP(B58, Info!$P$7:$P$1000, 1, FALSE), 0)","v":1},{"$f":"IFERROR(VLOOKUP(B58, Info!$Q$7:$Q$1000, 1, FALSE)/VLOOKUP(B58, Info!$Q$7:$Q$1000, 1, FALSE), 0)","v":0},{"$f":"IF(OR(P58=1, AH58=1, AI58=1), 1, 0)","v":1}]
[20210331,8660,467658,"COMMERCIAL BANK & TRUST CO.",1,1028764,"TN","FDIC","NM",0,13,1099382,1099382,0,1,0,91231,91231,98360,995847,570000,16.010000000000002,16.010000000000002,17.260000000000002,9.16,69159,53854,513665,0,312255,0,0,4141,{"$f":"IFERROR(VLOOKUP(B59, Info!$P$7:$P$1000, 1, FALSE)/VLOOKUP(B59, Info!$P$7:$P$1000, 1, FALSE), 0)","v":1},{"$f":"IFERROR(VLOOKUP(B59, Info!$Q$7:$Q$1000, 1, FALSE)/VLOOKUP(B59, Info!$Q$7:$Q$1000, 1, FALSE), 0)","v":0},{"$f":"IF(OR(P59=1, AH59=1, AI59=1), 1, 0)","v":1}]
[20210331,8798,473930,"COTTONPORT BANK",1,458355,"LA","FDIC","NM",0,13,1081097,1081097,1,0,0,50984,50984,0,434710,0,null,null,null,11.73,14925,132716,254640,623,46221,0,0,390,{"$f":"IFERROR(VLOOKUP(B60, Info!$P$7:$P$1000, 1, FALSE)/VLOOKUP(B60, Info!$P$7:$P$1000, 1, FALSE), 0)","v":1},{"$f":"IFERROR(VLOOKUP(B60, Info!$Q$7:$Q$1000, 1, FALSE)/VLOOKUP(B60, Info!$Q$7:$Q$1000, 1, FALSE), 0)","v":0},{"$f":"IF(OR(P60=1, AH60=1, AI60=1), 1, 0)","v":1}]
[20210331,8870,914648,"BANKFIRST FINANCIAL SERVICES",1,1780098,"MS","FED","SM",0,13,1247455,1247455,0,0,0,150348,150348,164813,1740140,1155036,13.02,13.02,14.27,8.64,33045,60599,1135122,0,411930,0,0,38939,{"$f":"IFERROR(VLOOKUP(B61, Info!$P$7:$P$1000, 1, FALSE)/VLOOKUP(B61, Info!$P$7:$P$1000, 1, FALSE), 0)","v":1},{"$f":"IFERROR(VLOOKUP(B61, Info!$Q$7:$Q$1000, 1, FALSE)/VLOOKUP(B61, Info!$Q$7:$Q$1000, 1, FALSE), 0)","v":0},{"$f":"IF(OR(P61=1, AH61=1, AI61=1), 1, 0)","v":1}]
[20210331,8980,52951,"SECURITY STATE BANK OF OKLAHOMA",1,290322,"OK","FDIC","NM",0,13,4414838,4414838,0,0,0,35689,35689,38447,282729,218568,16.329999999999998,16.329999999999998,17.59,12.62,8968,13453,207689,0,50448,0,0,263,{"$f":"IFERROR(VLOOKUP(B62, Info!$P$7:$P$1000, 1, FALSE)/VLOOKUP(B62, Info!$P$7:$P$1000, 1, FALSE), 0)","v":1},{"$f":"IFERROR(VLOOKUP(B62, Info!$Q$7:$Q$1000, 1, FALSE)/VLOOKUP(B62, Info!$Q$7:$Q$1000, 1, FALSE), 0)","v":0},{"$f":"IF(OR(P62=1, AH62=1, AI62=1), 1, 0)","v":1}]
[20210331,9057,586335,"BANK OF MOUNDVILLE",1,104817,"AL","FDIC","NM",0,5,2317690,2317690,0,0,0,9179,9179,9614,102131,52242,17.57,17.57,18.399999999999999,8.99,5875,250,35260,0,60188,0,0,0,{"$f":"IFERROR(VLOOKUP(B63, Info!$P$7:$P$1000, 1, FALSE)/VLOOKUP(B63, Info!$P$7:$P$1000, 1, FALSE), 0)","v":1},{"$f":"IFERROR(VLOOKUP(B63, Info!$Q$7:$Q$1000, 1, FALSE)/VLOOKUP(B63, Info!$Q$7:$Q$1000, 1, FALSE), 0)","v":0},{"$f":"IF(OR(P63=1, AH63=1, AI63=1), 1, 0)","v":1}]
[20210331,9168,511832,"WAYNE COUNTY BANK",1,363950,"TN","FDIC","NM",0,13,1084829,1084829,1,0,0,49993,49993,0,356173,0,null,null,null,14.04,65070,6739,232374,0,33540,0,0,0,{"$f":"IFERROR(VLOOKUP(B64, Info!$P$7:$P$1000, 1, FALSE)/VLOOKUP(B64, Info!$P$7:$P$1000, 1, FALSE), 0)","v":1},{"$f":"IFERROR(VLOOKUP(B64, Info!$Q$7:$Q$1000, 1, FALSE)/VLOOKUP(B64, Info!$Q$7:$Q$1000, 1, FALSE), 0)","v":0},{"$f":"IF(OR(P64=1, AH64=1, AI64=1), 1, 0)","v":1}]
[20210331,9172,118156,"SECURITY BANK AND TRUST COMPANY",1,777096,"TN","FDIC","NM",0,13,5473421,5473421,0,1,0,69219,69219,71044,712363,602151,11.5,11.5,11.8,9.7200000000000006,20701,8704,581864,0,108558,0,5009,2504,{"$f":"IFERROR(VLOOKUP(B65, Info!$P$7:$P$1000, 1, FALSE)/VLOOKUP(B65, Info!$P$7:$P$1000, 1, FALSE), 0)","v":1},{"$f":"IFERROR(VLOOKUP(B65, Info!$Q$7:$Q$1000, 1, FALSE)/VLOOKUP(B65, Info!$Q$7:$Q$1000, 1, FALSE), 0)","v":0},{"$f":"IF(OR(P65=1, AH65=1, AI65=1), 1, 0)","v":1}]
[20210331,9322,755252,"CROSS KEYS BANK",1,455625,"LA","FDIC","NM",0,13,1132382,1132382,0,1,0,49619,49619,52128,443305,311479,15.93,15.93,16.739999999999998,11.19,8419,19211,270855,242,138502,0,0,207,{"$f":"IFERROR(VLOOKUP(B66, Info!$P$7:$P$1000, 1, FALSE)/VLOOKUP(B66, Info!$P$7:$P$1000, 1, FALSE), 0)","v":1},{"$f":"IFERROR(VLOOKUP(B66, Info!$Q$7:$Q$1000, 1, FALSE)/VLOOKUP(B66, Info!$Q$7:$Q$1000, 1, FALSE), 0)","v":0},{"$f":"IF(OR(P66=1, AH66=1, AI66=1), 1, 0)","v":1}]
[20210331,9327,653134,"FARMERS-MERCHANTS BANK & TRUST COMPANY",1,387526,"LA","FDIC","NM",0,13,null,null,0,1,0,45691,45691,48709,368702,241105,18.95,18.95,20.2,12.39,6567,89966,240260,0,36374,0,0,0,{"$f":"IFERROR(VLOOKUP(B67, Info!$P$7:$P$1000, 1, FALSE)/VLOOKUP(B67, Info!$P$7:$P$1000, 1, FALSE), 0)","v":1},{"$f":"IFERROR(VLOOKUP(B67, Info!$Q$7:$Q$1000, 1, FALSE)/VLOOKUP(B67, Info!$Q$7:$Q$1000, 1, FALSE), 0)","v":0},{"$f":"IF(OR(P67=1, AH67=1, AI67=1), 1, 0)","v":1}]
[20210331,9356,700430,"THE COMMERCIAL BANK",1,203117,"MS","FDIC","NM",0,13,1086739,1086739,1,0,0,18730,18730,0,192357,0,null,null,null,9.74,7745,3094,102871,0,76184,0,0,0,{"$f":"IFERROR(VLOOKUP(B68, Info!$P$7:$P$1000, 1, FALSE)/VLOOKUP(B68, Info!$P$7:$P$1000, 1, FALSE), 0)","v":1},{"$f":"IFERROR(VLOOKUP(B68, Info!$Q$7:$Q$1000, 1, FALSE)/VLOOKUP(B68, Info!$Q$7:$Q$1000, 1, FALSE), 0)","v":0},{"$f":"IF(OR(P68=1, AH68=1, AI68=1), 1, 0)","v":1}]
[20210331,9359,99442,"BANK OF COMMERCE",1,725207,"MS","FDIC","NM",0,13,2770660,2770660,1,0,0,62067,62067,0,621658,0,null,null,null,9.98,18749,37016,359260,0,286366,0,0,5770,{"$f":"IFERROR(VLOOKUP(B69, Info!$P$7:$P$1000, 1, FALSE)/VLOOKUP(B69, Info!$P$7:$P$1000, 1, FALSE), 0)","v":1},{"$f":"IFERROR(VLOOKUP(B69, Info!$Q$7:$Q$1000, 1, FALSE)/VLOOKUP(B69, Info!$Q$7:$Q$1000, 1, FALSE), 0)","v":0},{"$f":"IF(OR(P69=1, AH69=1, AI69=1), 1, 0)","v":1}]
[20210331,9366,70638,"PEOPLES BANK",1,417454,"MS","FDIC","NM",0,13,4189314,4189314,0,1,0,37772,37772,41070,405035,260121,14.52,14.52,15.79,9.33,6340,32036,328993,0,32830,0,0,2367,{"$f":"IFERROR(VLOOKUP(B70, Info!$P$7:$P$1000, 1, FALSE)/VLOOKUP(B70, Info!$P$7:$P$1000, 1, FALSE), 0)","v":1},{"$f":"IFERROR(VLOOKUP(B70, Info!$Q$7:$Q$1000, 1, FALSE)/VLOOKUP(B70, Info!$Q$7:$Q$1000, 1, FALSE), 0)","v":0},{"$f":"IF(OR(P70=1, AH70=1, AI70=1), 1, 0)","v":1}]
[20210331,9775,780049,"BANK OF KILMICHAEL",1,221601,"MS","FDIC","NM",0,13,3097850,3097850,1,1,0,19943,19943,0,216791,0,null,null,null,9.1999999999999993,3246,15054,119723,3946,70911,0,0,0,{"$f":"IFERROR(VLOOKUP(B71, Info!$P$7:$P$1000, 1, FALSE)/VLOOKUP(B71, Info!$P$7:$P$1000, 1, FALSE), 0)","v":1},{"$f":"IFERROR(VLOOKUP(B71, Info!$Q$7:$Q$1000, 1, FALSE)/VLOOKUP(B71, Info!$Q$7:$Q$1000, 1, FALSE), 0)","v":0},{"$f":"IF(OR(P71=1, AH71=1, AI71=1), 1, 0)","v":1}]
[20210331,9777,729945,"CITIZENS BANK & TRUST CO.",1,141802,"MS","FDIC","NM",0,13,2605249,2605249,0,1,0,8908,8908,9906,151214,79478,11.21,11.21,12.46,5.89,7384,7300,57992,47044,0,0,0,0,{"$f":"IFERROR(VLOOKUP(B72, Info!$P$7:$P$1000, 1, FALSE)/VLOOKUP(B72, Info!$P$7:$P$1000, 1, FALSE), 0)","v":1},{"$f":"IFERROR(VLOOKUP(B72, Info!$Q$7:$Q$1000, 1, FALSE)/VLOOKUP(B72, Info!$Q$7:$Q$1000, 1, FALSE), 0)","v":0},{"$f":"IF(OR(P72=1, AH72=1, AI72=1), 1, 0)","v":1}]
[20210331,10319,55635,"CITIZENS SAVINGS BANK AND TRUST COMPANY",1,122180,"TN","FDIC","NM",0,13,3602227,3602227,0,0,1,9507,9507,10555,116217,83786,11.35,11.35,12.6,8.18,1407,25043,87176,0,7102,0,0,0,{"$f":"IFERROR(VLOOKUP(B73, Info!$P$7:$P$1000, 1, FALSE)/VLOOKUP(B73, Info!$P$7:$P$1000, 1, FALSE), 0)","v":1},{"$f":"IFERROR(VLOOKUP(B73, Info!$Q$7:$Q$1000, 1, FALSE)/VLOOKUP(B73, Info!$Q$7:$Q$1000, 1, FALSE), 0)","v":0},{"$f":"IF(OR(P73=1, AH73=1, AI73=1), 1, 0)","v":1}]
[20210331,10528,985451,"EXCHANGE BANK AND TRUST COMPANY, NATCHITOCHES, LOUISIANA",1,184191,"LA","FDIC","NM",0,13,1106525,1106525,0,1,0,15810,15810,16777,184191,77750,20.329999999999998,20.329999999999998,21.58,8.58,3215,8557,67606,0,103618,0,0,0,{"$f":"IFERROR(VLOOKUP(B74, Info!$P$7:$P$1000, 1, FALSE)/VLOOKUP(B74, Info!$P$7:$P$1000, 1, FALSE), 0)","v":1},{"$f":"IFERROR(VLOOKUP(B74, Info!$Q$7:$Q$1000, 1, FALSE)/VLOOKUP(B74, Info!$Q$7:$Q$1000, 1, FALSE), 0)","v":0},{"$f":"IF(OR(P74=1, AH74=1, AI74=1), 1, 0)","v":1}]
[20210331,10531,732253,"CITIZENS PROGRESSIVE BANK",1,201135,"LA","FDIC","NM",0,13,1108985,1108985,0,1,0,16248,16248,17397,192175,143961,11.29,11.29,12.08,8.4499999999999993,2986,28139,146208,0,10425,0,0,4538,{"$f":"IFERROR(VLOOKUP(B75, Info!$P$7:$P$1000, 1, FALSE)/VLOOKUP(B75, Info!$P$7:$P$1000, 1, FALSE), 0)","v":1},{"$f":"IFERROR(VLOOKUP(B75, Info!$Q$7:$Q$1000, 1, FALSE)/VLOOKUP(B75, Info!$Q$7:$Q$1000, 1, FALSE), 0)","v":0},{"$f":"IF(OR(P75=1, AH75=1, AI75=1), 1, 0)","v":1}]
[20210331,10532,930853,"CLB THE COMMUNITY BANK",1,240752,"LA","FDIC","NM",0,13,1109722,1109722,1,1,0,21171,21171,0,231406,0,null,null,null,9.15,6907,36051,133003,0,59620,0,0,113,{"$f":"IFERROR(VLOOKUP(B76, Info!$P$7:$P$1000, 1, FALSE)/VLOOKUP(B76, Info!$P$7:$P$1000, 1, FALSE), 0)","v":1},{"$f":"IFERROR(VLOOKUP(B76, Info!$Q$7:$Q$1000, 1, FALSE)/VLOOKUP(B76, Info!$Q$7:$Q$1000, 1, FALSE), 0)","v":0},{"$f":"IF(OR(P76=1, AH76=1, AI76=1), 1, 0)","v":1}]
[20210331,10533,628552,"WINNSBORO STATE BANK & TRUST COMPANY",1,266181,"LA","FDIC","NM",0,13,1107081,1107081,0,1,0,24146,24146,25913,258336,178593,13.52,13.52,14.51,9.35,4215,21052,182296,0,46681,0,0,1778,{"$f":"IFERROR(VLOOKUP(B77, Info!$P$7:$P$1000, 1, FALSE)/VLOOKUP(B77, Info!$P$7:$P$1000, 1, FALSE), 0)","v":1},{"$f":"IFERROR(VLOOKUP(B77, Info!$Q$7:$Q$1000, 1, FALSE)/VLOOKUP(B77, Info!$Q$7:$Q$1000, 1, FALSE), 0)","v":0},{"$f":"IF(OR(P77=1, AH77=1, AI77=1), 1, 0)","v":1}]
[20210331,10594,68831,"BANK OF FRANKLIN",1,188460,"MS","FDIC","NM",0,13,3674215,3674215,1,0,0,18545,18545,0,180256,0,null,null,null,10.29,7218,13965,110374,112,50789,0,0,0,{"$f":"IFERROR(VLOOKUP(B78, Info!$P$7:$P$1000, 1, FALSE)/VLOOKUP(B78, Info!$P$7:$P$1000, 1, FALSE), 0)","v":1},{"$f":"IFERROR(VLOOKUP(B78, Info!$Q$7:$Q$1000, 1, FALSE)/VLOOKUP(B78, Info!$Q$7:$Q$1000, 1, FALSE), 0)","v":0},{"$f":"IF(OR(P78=1, AH78=1, AI78=1), 1, 0)","v":1}]
[20210331,10843,441135,"CITIZENS BANK OF CHATSWORTH",1,41065,"IL","FDIC","NM",0,9,5164626,5164626,0,0,1,3359,3359,3629,42004,21413,15.69,15.69,16.95,8,270,3004,28614,0,7198,0,0,473,{"$f":"IFERROR(VLOOKUP(B79, Info!$P$7:$P$1000, 1, FALSE)/VLOOKUP(B79, Info!$P$7:$P$1000, 1, FALSE), 0)","v":0},{"$f":"IFERROR(VLOOKUP(B79, Info!$Q$7:$Q$1000, 1, FALSE)/VLOOKUP(B79, Info!$Q$7:$Q$1000, 1, FALSE), 0)","v":0},{"$f":"IF(OR(P79=1, AH79=1, AI79=1), 1, 0)","v":1}]
[20210331,11003,365950,"LIMEBANK",1,73919,"MO","FDIC","NM",0,11,5210372,5210372,0,0,0,6142,6142,6647,69204,43349,14.17,14.17,15.33,8.8800000000000008,1655,15279,50548,0,3947,0,0,1464,{"$f":"IFERROR(VLOOKUP(B80, Info!$P$7:$P$1000, 1, FALSE)/VLOOKUP(B80, Info!$P$7:$P$1000, 1, FALSE), 0)","v":1},{"$f":"IFERROR(VLOOKUP(B80, Info!$Q$7:$Q$1000, 1, FALSE)/VLOOKUP(B80, Info!$Q$7:$Q$1000, 1, FALSE), 0)","v":0},{"$f":"IF(OR(P80=1, AH80=1, AI80=1), 1, 0)","v":1}]
[20210331,11242,897648,"MCGEHEE BANK",1,144947,"AR","FDIC","NM",0,13,3487965,1096662,1,1,0,18250,18250,0,143406,0,null,null,null,12.73,2691,500,86306,4,28367,0,0,0,{"$f":"IFERROR(VLOOKUP(B81, Info!$P$7:$P$1000, 1, FALSE)/VLOOKUP(B81, Info!$P$7:$P$1000, 1, FALSE), 0)","v":1},{"$f":"IFERROR(VLOOKUP(B81, Info!$Q$7:$Q$1000, 1, FALSE)/VLOOKUP(B81, Info!$Q$7:$Q$1000, 1, FALSE), 0)","v":0},{"$f":"IF(OR(P81=1, AH81=1, AI81=1), 1, 0)","v":1}]
[20210331,11252,379649,"THE FIRST NATIONAL BANK OF IZARD COUNTY",1,192643,"AR","OCC","N",0,13,1246618,1246618,1,0,0,61025,61025,0,186092,0,null,null,null,32.79,19692,1490,73877,9122,44493,0,0,0,{"$f":"IFERROR(VLOOKUP(B82, Info!$P$7:$P$1000, 1, FALSE)/VLOOKUP(B82, Info!$P$7:$P$1000, 1, FALSE), 0)","v":0},{"$f":"IFERROR(VLOOKUP(B82, Info!$Q$7:$Q$1000, 1, FALSE)/VLOOKUP(B82, Info!$Q$7:$Q$1000, 1, FALSE), 0)","v":1},{"$f":"IF(OR(P82=1, AH82=1, AI82=1), 1, 0)","v":1}]
[20210331,11423,924843,"SYCAMORE BANK",1,300995,"MS","FDIC","NM",0,13,1119589,1119589,1,0,0,24763,24763,0,285427,0,null,null,null,8.68,6655,45284,166557,0,69403,394,0,0,{"$f":"IFERROR(VLOOKUP(B83, Info!$P$7:$P$1000, 1, FALSE)/VLOOKUP(B83, Info!$P$7:$P$1000, 1, FALSE), 0)","v":1},{"$f":"IFERROR(VLOOKUP(B83, Info!$Q$7:$Q$1000, 1, FALSE)/VLOOKUP(B83, Info!$Q$7:$Q$1000, 1, FALSE), 0)","v":0},{"$f":"IF(OR(P83=1, AH83=1, AI83=1), 1, 0)","v":1}]
[20210331,11445,703039,"THE JEFFERSON BANK",1,142439,"MS","FDIC","NM",0,13,1137033,1137033,0,0,0,22440,22440,24086,157078,129320,17.350000000000001,17.350000000000001,18.63,14.29,2297,814,90447,0,42390,0,0,0,{"$f":"IFERROR(VLOOKUP(B84, Info!$P$7:$P$1000, 1, FALSE)/VLOOKUP(B84, Info!$P$7:$P$1000, 1, FALSE), 0)","v":1},{"$f":"IFERROR(VLOOKUP(B84, Info!$Q$7:$Q$1000, 1, FALSE)/VLOOKUP(B84, Info!$Q$7:$Q$1000, 1, FALSE), 0)","v":0},{"$f":"IF(OR(P84=1, AH84=1, AI84=1), 1, 0)","v":1}]
[20210331,11446,837840,"MERCHANTS & FARMERS BANK",1,124547,"MS","FDIC","NM",0,13,1995523,1995523,1,1,0,11673,11673,0,119937,0,null,null,null,9.73,4134,16735,48916,0,49220,0,0,0,{"$f":"IFERROR(VLOOKUP(B85, Info!$P$7:$P$1000, 1, FALSE)/VLOOKUP(B85, Info!$P$7:$P$1000, 1, FALSE), 0)","v":1},{"$f":"IFERROR(VLOOKUP(B85, Info!$Q$7:$Q$1000, 1, FALSE)/VLOOKUP(B85, Info!$Q$7:$Q$1000, 1, FALSE), 0)","v":0},{"$f":"IF(OR(P85=1, AH85=1, AI85=1), 1, 0)","v":1}]
[20210331,11521,64552,"CHICKASAW COMMUNITY BANK",1,287748,"OK","FED","SM",0,13,3045721,3045721,0,0,1,31068,31068,33371,290166,186640,16.649999999999999,16.649999999999999,17.88,10.71,1133,12421,202988,0,36543,0,0,13867,{"$f":"IFERROR(VLOOKUP(B86, Info!$P$7:$P$1000, 1, FALSE)/VLOOKUP(B86, Info!$P$7:$P$1000, 1, FALSE), 0)","v":1},{"$f":"IFERROR(VLOOKUP(B86, Info!$Q$7:$Q$1000, 1, FALSE)/VLOOKUP(B86, Info!$Q$7:$Q$1000, 1, FALSE), 0)","v":0},{"$f":"IF(OR(P86=1, AH86=1, AI86=1), 1, 0)","v":1}]
[20210331,11785,925354,"CALDWELL BANK & TRUST COMPANY",1,202855,"LA","FDIC","NM",0,13,1108985,1108985,0,1,0,18212,18212,19358,202621,123943,14.69,14.69,15.62,8.99,2130,38030,136206,0,13199,0,0,0,{"$f":"IFERROR(VLOOKUP(B87, Info!$P$7:$P$1000, 1, FALSE)/VLOOKUP(B87, Info!$P$7:$P$1000, 1, FALSE), 0)","v":1},{"$f":"IFERROR(VLOOKUP(B87, Info!$Q$7:$Q$1000, 1, FALSE)/VLOOKUP(B87, Info!$Q$7:$Q$1000, 1, FALSE), 0)","v":0},{"$f":"IF(OR(P87=1, AH87=1, AI87=1), 1, 0)","v":1}]
[20210331,11792,1006652,"FRANKLIN STATE BANK & TRUST COMPANY",1,203033,"LA","FDIC","NM",0,13,1109731,1109731,0,1,0,17154,17154,18282,198310,90244,19.010000000000002,19.010000000000002,20.260000000000002,8.65,5459,56552,105962,0,30865,0,0,0,{"$f":"IFERROR(VLOOKUP(B88, Info!$P$7:$P$1000, 1, FALSE)/VLOOKUP(B88, Info!$P$7:$P$1000, 1, FALSE), 0)","v":1},{"$f":"IFERROR(VLOOKUP(B88, Info!$Q$7:$Q$1000, 1, FALSE)/VLOOKUP(B88, Info!$Q$7:$Q$1000, 1, FALSE), 0)","v":0},{"$f":"IF(OR(P88=1, AH88=1, AI88=1), 1, 0)","v":1}]
[20210331,11817,40033,"RICHTON BANK & TRUST COMPANY",1,58226,"MS","FDIC","NM",0,13,2782609,2782609,1,1,0,7839,7839,0,57704,0,null,null,null,13.58,1822,11165,19208,4,20063,0,0,0,{"$f":"IFERROR(VLOOKUP(B89, Info!$P$7:$P$1000, 1, FALSE)/VLOOKUP(B89, Info!$P$7:$P$1000, 1, FALSE), 0)","v":1},{"$f":"IFERROR(VLOOKUP(B89, Info!$Q$7:$Q$1000, 1, FALSE)/VLOOKUP(B89, Info!$Q$7:$Q$1000, 1, FALSE), 0)","v":0},{"$f":"IF(OR(P89=1, AH89=1, AI89=1), 1, 0)","v":1}]
[20210331,12201,12142,"THE CLEVELAND STATE BANK",1,302804,"MS","FDIC","NM",0,13,1913684,1913684,1,0,0,28243,28243,0,287549,0,null,null,null,9.82,13614,12946,130897,100,127276,0,0,0,{"$f":"IFERROR(VLOOKUP(B90, Info!$P$7:$P$1000, 1, FALSE)/VLOOKUP(B90, Info!$P$7:$P$1000, 1, FALSE), 0)","v":1},{"$f":"IFERROR(VLOOKUP(B90, Info!$Q$7:$Q$1000, 1, FALSE)/VLOOKUP(B90, Info!$Q$7:$Q$1000, 1, FALSE), 0)","v":0},{"$f":"IF(OR(P90=1, AH90=1, AI90=1), 1, 0)","v":1}]
[20210331,12203,94139,"MERCHANTS & MARINE BANK",1,742758,"MS","FDIC","NM",0,13,3696093,3696093,0,0,0,76631,76631,80565,661849,388716,19.71,19.71,20.73,11.58,24250,213960,355890,0,102458,356,0,4706,{"$f":"IFERROR(VLOOKUP(B91, Info!$P$7:$P$1000, 1, FALSE)/VLOOKUP(B91, Info!$P$7:$P$1000, 1, FALSE), 0)","v":1},{"$f":"IFERROR(VLOOKUP(B91, Info!$Q$7:$Q$1000, 1, FALSE)/VLOOKUP(B91, Info!$Q$7:$Q$1000, 1, FALSE), 0)","v":0},{"$f":"IF(OR(P91=1, AH91=1, AI91=1), 1, 0)","v":1}]
[20210331,12206,752644,"MECHANICS BANK",1,273866,"MS","FDIC","NM",0,13,3165106,3165106,1,0,0,26622,21672,0,262748,0,null,null,null,10.130000000000001,6559,36779,175299,0,31709,0,0,175,{"$f":"IFERROR(VLOOKUP(B92, Info!$P$7:$P$1000, 1, FALSE)/VLOOKUP(B92, Info!$P$7:$P$1000, 1, FALSE), 0)","v":1},{"$f":"IFERROR(VLOOKUP(B92, Info!$Q$7:$Q$1000, 1, FALSE)/VLOOKUP(B92, Info!$Q$7:$Q$1000, 1, FALSE), 0)","v":0},{"$f":"IF(OR(P92=1, AH92=1, AI92=1), 1, 0)","v":1}]
[20210331,12207,800442,"BANK OF WINONA",1,139447,"MS","FDIC","NM",0,13,3229503,3229503,0,1,0,13776,13776,14279,140923,101229,13.61,13.61,14.11,9.7799999999999994,2226,15378,50663,0,64144,0,0,0,{"$f":"IFERROR(VLOOKUP(B93, Info!$P$7:$P$1000, 1, FALSE)/VLOOKUP(B93, Info!$P$7:$P$1000, 1, FALSE), 0)","v":1},{"$f":"IFERROR(VLOOKUP(B93, Info!$Q$7:$Q$1000, 1, FALSE)/VLOOKUP(B93, Info!$Q$7:$Q$1000, 1, FALSE), 0)","v":0},{"$f":"IF(OR(P93=1, AH93=1, AI93=1), 1, 0)","v":1}]
[20210331,12266,332224,"MECHANICS & FARMERS BANK",1,343416,"NC","FDIC","NM",0,5,2807810,2807810,0,0,1,41044,41044,43428,321360,190490,21.55,21.55,22.8,12.77,21274,60813,185759,0,59333,0,0,0,{"$f":"IFERROR(VLOOKUP(B94, Info!$P$7:$P$1000, 1, FALSE)/VLOOKUP(B94, Info!$P$7:$P$1000, 1, FALSE), 0)","v":1},{"$f":"IFERROR(VLOOKUP(B94, Info!$Q$7:$Q$1000, 1, FALSE)/VLOOKUP(B94, Info!$Q$7:$Q$1000, 1, FALSE), 0)","v":0},{"$f":"IF(OR(P94=1, AH94=1, AI94=1), 1, 0)","v":1}]
[20210331,12761,163857,"F & M BANK",1,607037,"OK","FDIC","NM",0,13,1054550,1054550,1,1,1,58556,58556,0,582715,0,null,null,null,10.050000000000001,8220,31351,340518,19027,146504,0,0,314,{"$f":"IFERROR(VLOOKUP(B95, Info!$P$7:$P$1000, 1, FALSE)/VLOOKUP(B95, Info!$P$7:$P$1000, 1, FALSE), 0)","v":0},{"$f":"IFERROR(VLOOKUP(B95, Info!$Q$7:$Q$1000, 1, FALSE)/VLOOKUP(B95, Info!$Q$7:$Q$1000, 1, FALSE), 0)","v":0},{"$f":"IF(OR(P95=1, AH95=1, AI95=1), 1, 0)","v":1}]
[20210331,13798,844455,"FIRST NATIONAL BANK IN FREDONIA",1,104852,"KS","OCC","N",0,11,1064081,1064081,1,1,0,16194,16194,0,103981,0,null,null,null,15.57,1746,4272,37334,0,61697,0,0,0,{"$f":"IFERROR(VLOOKUP(B96, Info!$P$7:$P$1000, 1, FALSE)/VLOOKUP(B96, Info!$P$7:$P$1000, 1, FALSE), 0)","v":0},{"$f":"IFERROR(VLOOKUP(B96, Info!$Q$7:$Q$1000, 1, FALSE)/VLOOKUP(B96, Info!$Q$7:$Q$1000, 1, FALSE), 0)","v":1},{"$f":"IF(OR(P96=1, AH96=1, AI96=1), 1, 0)","v":1}]
[20210331,13959,71859,"CBW BANK",1,92161,"KS","FDIC","NM",0,11,3914872,3914872,0,0,1,15506,15506,15612,54822,8380,185.04,185.04,186.3,28.28,9847,21239,56366,0,3112,0,0,0,{"$f":"IFERROR(VLOOKUP(B97, Info!$P$7:$P$1000, 1, FALSE)/VLOOKUP(B97, Info!$P$7:$P$1000, 1, FALSE), 0)","v":1},{"$f":"IFERROR(VLOOKUP(B97, Info!$Q$7:$Q$1000, 1, FALSE)/VLOOKUP(B97, Info!$Q$7:$Q$1000, 1, FALSE), 0)","v":0},{"$f":"IF(OR(P97=1, AH97=1, AI97=1), 1, 0)","v":1}]
[20210331,14331,296456,"FIRSTBANK",1,568991,"OK","FED","SM",0,13,1133370,1133370,1,1,1,44986,44986,0,531784,0,null,null,null,8.4600000000000009,12182,96597,370245,0,37047,0,0,8722,{"$f":"IFERROR(VLOOKUP(B98, Info!$P$7:$P$1000, 1, FALSE)/VLOOKUP(B98, Info!$P$7:$P$1000, 1, FALSE), 0)","v":0},{"$f":"IFERROR(VLOOKUP(B98, Info!$Q$7:$Q$1000, 1, FALSE)/VLOOKUP(B98, Info!$Q$7:$Q$1000, 1, FALSE), 0)","v":0},{"$f":"IF(OR(P98=1, AH98=1, AI98=1), 1, 0)","v":1}]
[20210331,14400,74449,"FIRST NATIONAL BANK IN TIGERTON",1,27890,"WI","OCC","N",0,9,1204720,1204720,1,1,0,3382,3382,0,26238,0,null,null,null,12.89,751,11838,11031,4004,0,0,0,0,{"$f":"IFERROR(VLOOKUP(B99, Info!$P$7:$P$1000, 1, FALSE)/VLOOKUP(B99, Info!$P$7:$P$1000, 1, FALSE), 0)","v":0},{"$f":"IFERROR(VLOOKUP(B99, Info!$Q$7:$Q$1000, 1, FALSE)/VLOOKUP(B99, Info!$Q$7:$Q$1000, 1, FALSE), 0)","v":1},{"$f":"IF(OR(P99=1, AH99=1, AI99=1), 1, 0)","v":1}]
[20210331,14679,536527,"INDUSTRIAL BANK",1,575939,"DC","FDIC","NM",0,2,2326179,2326179,0,0,1,47384,47384,51600,572155,335982,14.1,14.1,15.36,8.2799999999999994,4514,91262,339983,0,111563,937,0,298,{"$f":"IFERROR(VLOOKUP(B100, Info!$P$7:$P$1000, 1, FALSE)/VLOOKUP(B100, Info!$P$7:$P$1000, 1, FALSE), 0)","v":1},{"$f":"IFERROR(VLOOKUP(B100, Info!$Q$7:$Q$1000, 1, FALSE)/VLOOKUP(B100, Info!$Q$7:$Q$1000, 1, FALSE), 0)","v":0},{"$f":"IF(OR(P100=1, AH100=1, AI100=1), 1, 0)","v":1}]
[20210331,15118,3851427,"GATEWAY FIRST BANK",1,2048941,"OK","FDIC","NM",0,13,null,null,0,0,1,278852,278852,284592,1874019,1087571,25.64,25.64,26.17,14.88,16470,227131,1495619,0,53301,0,0,151428,{"$f":"IFERROR(VLOOKUP(B101, Info!$P$7:$P$1000, 1, FALSE)/VLOOKUP(B101, Info!$P$7:$P$1000, 1, FALSE), 0)","v":0},{"$f":"IFERROR(VLOOKUP(B101, Info!$Q$7:$Q$1000, 1, FALSE)/VLOOKUP(B101, Info!$Q$7:$Q$1000, 1, FALSE), 0)","v":0},{"$f":"IF(OR(P101=1, AH101=1, AI101=1), 1, 0)","v":1}]
[20210331,15205,502652,"BANK3",1,348213,"TN","FDIC","NM",0,13,4953337,4953337,1,0,0,31946,31946,0,348123,0,null,null,null,9.18,2912,21821,281839,0,26633,0,0,6,{"$f":"IFERROR(VLOOKUP(B102, Info!$P$7:$P$1000, 1, FALSE)/VLOOKUP(B102, Info!$P$7:$P$1000, 1, FALSE), 0)","v":1},{"$f":"IFERROR(VLOOKUP(B102, Info!$Q$7:$Q$1000, 1, FALSE)/VLOOKUP(B102, Info!$Q$7:$Q$1000, 1, FALSE), 0)","v":0},{"$f":"IF(OR(P102=1, AH102=1, AI102=1), 1, 0)","v":1}]
[20210331,15547,476445,"BANK OF LAKE VILLAGE",1,72066,"AR","FED","SM",0,13,1137033,1137033,0,0,0,9022,9022,9544,71543,41364,21.81,21.81,23.07,12.61,1813,3487,36099,987,22380,0,0,0,{"$f":"IFERROR(VLOOKUP(B103, Info!$P$7:$P$1000, 1, FALSE)/VLOOKUP(B103, Info!$P$7:$P$1000, 1, FALSE), 0)","v":1},{"$f":"IFERROR(VLOOKUP(B103, Info!$Q$7:$Q$1000, 1, FALSE)/VLOOKUP(B103, Info!$Q$7:$Q$1000, 1, FALSE), 0)","v":0},{"$f":"IF(OR(P103=1, AH103=1, AI103=1), 1, 0)","v":1}]
[20210331,15611,285759,"OKLAHOMA STATE BANK",1,219005,"OK","FDIC","NM",0,13,1059797,1059797,0,1,1,19924,19924,21653,216060,137347,14.51,14.51,15.77,9.2200000000000006,2585,0,130717,0,37424,0,0,1875,{"$f":"IFERROR(VLOOKUP(B104, Info!$P$7:$P$1000, 1, FALSE)/VLOOKUP(B104, Info!$P$7:$P$1000, 1, FALSE), 0)","v":0},{"$f":"IFERROR(VLOOKUP(B104, Info!$Q$7:$Q$1000, 1, FALSE)/VLOOKUP(B104, Info!$Q$7:$Q$1000, 1, FALSE), 0)","v":0},{"$f":"IF(OR(P104=1, AH104=1, AI104=1), 1, 0)","v":1}]
[20210331,15663,924236,"FIRST STATE BANK",1,894209,"MS","FDIC","NM",0,13,1083587,1083587,1,0,0,98782,98782,0,891740,0,null,null,null,11.08,83056,0,469014,7253,233730,0,0,9111,{"$f":"IFERROR(VLOOKUP(B105, Info!$P$7:$P$1000, 1, FALSE)/VLOOKUP(B105, Info!$P$7:$P$1000, 1, FALSE), 0)","v":1},{"$f":"IFERROR(VLOOKUP(B105, Info!$Q$7:$Q$1000, 1, FALSE)/VLOOKUP(B105, Info!$Q$7:$Q$1000, 1, FALSE), 0)","v":0},{"$f":"IF(OR(P105=1, AH105=1, AI105=1), 1, 0)","v":1}]
[20210331,15695,478430,"FIRST BANK OF LINDEN",1,86866,"AL","FDIC","NM",0,5,2059954,2059954,0,0,0,12750,12750,13053,87952,40156,31.75,31.75,32.51,14.5,6358,0,20954,29,48531,0,0,0,{"$f":"IFERROR(VLOOKUP(B106, Info!$P$7:$P$1000, 1, FALSE)/VLOOKUP(B106, Info!$P$7:$P$1000, 1, FALSE), 0)","v":1},{"$f":"IFERROR(VLOOKUP(B106, Info!$Q$7:$Q$1000, 1, FALSE)/VLOOKUP(B106, Info!$Q$7:$Q$1000, 1, FALSE), 0)","v":0},{"$f":"IF(OR(P106=1, AH106=1, AI106=1), 1, 0)","v":1}]
[20210331,15729,335346,"PARTNERS BANK",1,340604,"AR","FDIC","NM",0,13,1129494,1129494,1,0,0,28911,28911,0,333402,0,null,null,null,8.67,3425,36631,248295,0,41159,0,0,0,{"$f":"IFERROR(VLOOKUP(B107, Info!$P$7:$P$1000, 1, FALSE)/VLOOKUP(B107, Info!$P$7:$P$1000, 1, FALSE), 0)","v":1},{"$f":"IFERROR(VLOOKUP(B107, Info!$Q$7:$Q$1000, 1, FALSE)/VLOOKUP(B107, Info!$Q$7:$Q$1000, 1, FALSE), 0)","v":0},{"$f":"IF(OR(P107=1, AH107=1, AI107=1), 1, 0)","v":1}]
[20210331,15801,205243,"FARMERS AND MERCHANTS BANK",1,436159,"MS","FED","SM",0,13,null,null,1,0,0,56126,56126,0,426913,0,null,null,null,13.15,7394,54722,224759,0,126435,0,0,361,{"$f":"IFERROR(VLOOKUP(B108, Info!$P$7:$P$1000, 1, FALSE)/VLOOKUP(B108, Info!$P$7:$P$1000, 1, FALSE), 0)","v":1},{"$f":"IFERROR(VLOOKUP(B108, Info!$Q$7:$Q$1000, 1, FALSE)/VLOOKUP(B108, Info!$Q$7:$Q$1000, 1, FALSE), 0)","v":0},{"$f":"IF(OR(P108=1, AH108=1, AI108=1), 1, 0)","v":1}]
[20210331,15817,659640,"GENESIS BANK",1,22081,"MS","FDIC","NM",0,13,5450178,5450178,0,0,0,3927,3927,4032,23300,9137,42.98,42.98,44.13,16.850000000000001,1934,999,6176,2846,0,0,0,0,{"$f":"IFERROR(VLOOKUP(B109, Info!$P$7:$P$1000, 1, FALSE)/VLOOKUP(B109, Info!$P$7:$P$1000, 1, FALSE), 0)","v":1},{"$f":"IFERROR(VLOOKUP(B109, Info!$Q$7:$Q$1000, 1, FALSE)/VLOOKUP(B109, Info!$Q$7:$Q$1000, 1, FALSE), 0)","v":0},{"$f":"IF(OR(P109=1, AH109=1, AI109=1), 1, 0)","v":1}]
[20210331,15871,593249,"THE PEOPLES BANK",1,515100,"MS","FDIC","NM",0,13,1097061,1097061,0,0,0,47054,47054,49181,493827,226605,20.76,20.76,21.7,9.5299999999999994,12311,7506,186426,94983,188559,0,0,634,{"$f":"IFERROR(VLOOKUP(B110, Info!$P$7:$P$1000, 1, FALSE)/VLOOKUP(B110, Info!$P$7:$P$1000, 1, FALSE), 0)","v":1},{"$f":"IFERROR(VLOOKUP(B110, Info!$Q$7:$Q$1000, 1, FALSE)/VLOOKUP(B110, Info!$Q$7:$Q$1000, 1, FALSE), 0)","v":0},{"$f":"IF(OR(P110=1, AH110=1, AI110=1), 1, 0)","v":1}]
[20210331,15953,84541,"GUARANTY BANK AND TRUST COMPANY",1,1351710,"MS","FDIC","NM",0,13,1096952,1096952,1,1,0,111177,111177,0,1280485,0,null,null,null,8.68,29084,98440,951245,127166,81763,0,0,7940,{"$f":"IFERROR(VLOOKUP(B111, Info!$P$7:$P$1000, 1, FALSE)/VLOOKUP(B111, Info!$P$7:$P$1000, 1, FALSE), 0)","v":1},{"$f":"IFERROR(VLOOKUP(B111, Info!$Q$7:$Q$1000, 1, FALSE)/VLOOKUP(B111, Info!$Q$7:$Q$1000, 1, FALSE), 0)","v":0},{"$f":"IF(OR(P111=1, AH111=1, AI111=1), 1, 0)","v":1}]
[20210331,16175,501132,"WEST ALABAMA BANK & TRUST",1,758038,"AL","FDIC","NM",0,5,1085255,1085255,1,0,0,86273,86273,0,732016,0,null,null,null,11.79,5958,14615,386044,0,304309,0,0,7026,{"$f":"IFERROR(VLOOKUP(B112, Info!$P$7:$P$1000, 1, FALSE)/VLOOKUP(B112, Info!$P$7:$P$1000, 1, FALSE), 0)","v":1},{"$f":"IFERROR(VLOOKUP(B112, Info!$Q$7:$Q$1000, 1, FALSE)/VLOOKUP(B112, Info!$Q$7:$Q$1000, 1, FALSE), 0)","v":0},{"$f":"IF(OR(P112=1, AH112=1, AI112=1), 1, 0)","v":1}]
[20210331,16185,472531,"THE SAMSON BANKING COMPANY, INC.",1,104822,"AL","FDIC","NM",0,5,null,null,1,1,0,12218,12218,0,102185,0,null,null,null,11.96,1672,14576,46273,0,41186,0,0,0,{"$f":"IFERROR(VLOOKUP(B113, Info!$P$7:$P$1000, 1, FALSE)/VLOOKUP(B113, Info!$P$7:$P$1000, 1, FALSE), 0)","v":1},{"$f":"IFERROR(VLOOKUP(B113, Info!$Q$7:$Q$1000, 1, FALSE)/VLOOKUP(B113, Info!$Q$7:$Q$1000, 1, FALSE), 0)","v":0},{"$f":"IF(OR(P113=1, AH113=1, AI113=1), 1, 0)","v":1}]
[20210331,16511,515054,"TRI-STATE BANK OF MEMPHIS",1,105271,"TN","FDIC","NM",0,13,null,null,0,0,1,7524,5710,8254,100960,57383,9.9499999999999993,13.11,14.38,7.45,6789,103,50092,0,21655,0,0,0,{"$f":"IFERROR(VLOOKUP(B114, Info!$P$7:$P$1000, 1, FALSE)/VLOOKUP(B114, Info!$P$7:$P$1000, 1, FALSE), 0)","v":1},{"$f":"IFERROR(VLOOKUP(B114, Info!$Q$7:$Q$1000, 1, FALSE)/VLOOKUP(B114, Info!$Q$7:$Q$1000, 1, FALSE), 0)","v":0},{"$f":"IF(OR(P114=1, AH114=1, AI114=1), 1, 0)","v":1}]
[20210331,16584,370833,"CARVER STATE BANK",1,67252,"GA","FDIC","NM",0,5,3190023,3190023,1,0,1,7009,7009,0,54301,0,null,null,null,12.91,1157,24917,35890,0,1494,0,0,0,{"$f":"IFERROR(VLOOKUP(B115, Info!$P$7:$P$1000, 1, FALSE)/VLOOKUP(B115, Info!$P$7:$P$1000, 1, FALSE), 0)","v":1},{"$f":"IFERROR(VLOOKUP(B115, Info!$Q$7:$Q$1000, 1, FALSE)/VLOOKUP(B115, Info!$Q$7:$Q$1000, 1, FALSE), 0)","v":0},{"$f":"IF(OR(P115=1, AH115=1, AI115=1), 1, 0)","v":1}]
[20210331,16612,568939,"FIRST NATIONAL BANK OF PICAYUNE",1,252642,"MS","OCC","N",0,13,1083318,1083318,0,1,0,32679,32679,34422,244772,139291,23.46,23.46,24.71,13.35,9541,24017,138101,0,75372,0,0,0,{"$f":"IFERROR(VLOOKUP(B116, Info!$P$7:$P$1000, 1, FALSE)/VLOOKUP(B116, Info!$P$7:$P$1000, 1, FALSE), 0)","v":1},{"$f":"IFERROR(VLOOKUP(B116, Info!$Q$7:$Q$1000, 1, FALSE)/VLOOKUP(B116, Info!$Q$7:$Q$1000, 1, FALSE), 0)","v":0},{"$f":"IF(OR(P116=1, AH116=1, AI116=1), 1, 0)","v":1}]
[20210331,16689,734350,"GIBSLAND BANK & TRUST COMPANY",1,469384,"LA","FDIC","NM",0,13,1136102,1136102,0,0,0,50134,50134,53461,455781,337890,14.84,14.84,15.82,11,15426,44277,284243,35660,54848,0,0,0,{"$f":"IFERROR(VLOOKUP(B117, Info!$P$7:$P$1000, 1, FALSE)/VLOOKUP(B117, Info!$P$7:$P$1000, 1, FALSE), 0)","v":1},{"$f":"IFERROR(VLOOKUP(B117, Info!$Q$7:$Q$1000, 1, FALSE)/VLOOKUP(B117, Info!$Q$7:$Q$1000, 1, FALSE), 0)","v":0},{"$f":"IF(OR(P117=1, AH117=1, AI117=1), 1, 0)","v":1}]
[20210331,16854,768458,"COMMUNITY 1ST BANK LAS VEGAS",1,172784,"NM","FDIC","NM",0,13,2921695,2921695,0,1,1,15857,15857,16745,162240,70848,22.38,22.38,23.64,9.77,3281,19214,62224,0,62794,0,0,0,{"$f":"IFERROR(VLOOKUP(B118, Info!$P$7:$P$1000, 1, FALSE)/VLOOKUP(B118, Info!$P$7:$P$1000, 1, FALSE), 0)","v":0},{"$f":"IFERROR(VLOOKUP(B118, Info!$Q$7:$Q$1000, 1, FALSE)/VLOOKUP(B118, Info!$Q$7:$Q$1000, 1, FALSE), 0)","v":0},{"$f":"IF(OR(P118=1, AH118=1, AI118=1), 1, 0)","v":1}]
[20210331,17001,377850,"FIRST SECURITY BANK AND TRUST COMPANY",1,68242,"OK","FDIC","NM",0,13,3602058,3602058,0,1,1,5627,5627,6136,58832,55499,10.14,10.14,11.06,9.56,1007,10,53144,24,1332,0,0,0,{"$f":"IFERROR(VLOOKUP(B119, Info!$P$7:$P$1000, 1, FALSE)/VLOOKUP(B119, Info!$P$7:$P$1000, 1, FALSE), 0)","v":0},{"$f":"IFERROR(VLOOKUP(B119, Info!$Q$7:$Q$1000, 1, FALSE)/VLOOKUP(B119, Info!$Q$7:$Q$1000, 1, FALSE), 0)","v":0},{"$f":"IF(OR(P119=1, AH119=1, AI119=1), 1, 0)","v":1}]
[20210331,17009,751852,"CENTRAL BANK OF KANSAS CITY",1,325569,"MO","FDIC","NM",0,11,1063084,1063084,0,1,0,38869,38869,41962,306079,247202,15.72,15.72,16.97,12.7,7973,84293,223299,0,0,0,0,2442,{"$f":"IFERROR(VLOOKUP(B120, Info!$P$7:$P$1000, 1, FALSE)/VLOOKUP(B120, Info!$P$7:$P$1000, 1, FALSE), 0)","v":1},{"$f":"IFERROR(VLOOKUP(B120, Info!$Q$7:$Q$1000, 1, FALSE)/VLOOKUP(B120, Info!$Q$7:$Q$1000, 1, FALSE), 0)","v":0},{"$f":"IF(OR(P120=1, AH120=1, AI120=1), 1, 0)","v":1}]
[20210331,17120,718145,"FIRST SECURITY BANK",1,758278,"MS","FDIC","NM",0,13,1098509,1098509,0,0,0,64570,64570,69572,719476,448147,14.41,14.41,15.52,8.9700000000000006,20355,2076,394484,18130,215340,0,0,3874,{"$f":"IFERROR(VLOOKUP(B121, Info!$P$7:$P$1000, 1, FALSE)/VLOOKUP(B121, Info!$P$7:$P$1000, 1, FALSE), 0)","v":1},{"$f":"IFERROR(VLOOKUP(B121, Info!$Q$7:$Q$1000, 1, FALSE)/VLOOKUP(B121, Info!$Q$7:$Q$1000, 1, FALSE), 0)","v":0},{"$f":"IF(OR(P121=1, AH121=1, AI121=1), 1, 0)","v":1}]
[20210331,17190,124830,"BANK OF CAMILLA",1,128794,"GA","FDIC","NM",0,5,2087939,2087939,1,0,0,17039,17039,0,127463,0,null,null,null,13.37,15616,15464,59523,0,33157,21,0,0,{"$f":"IFERROR(VLOOKUP(B122, Info!$P$7:$P$1000, 1, FALSE)/VLOOKUP(B122, Info!$P$7:$P$1000, 1, FALSE), 0)","v":1},{"$f":"IFERROR(VLOOKUP(B122, Info!$Q$7:$Q$1000, 1, FALSE)/VLOOKUP(B122, Info!$Q$7:$Q$1000, 1, FALSE), 0)","v":0},{"$f":"IF(OR(P122=1, AH122=1, AI122=1), 1, 0)","v":1}]
[20210331,17881,432058,"FREEDOM BANK",1,75172,"TX","FDIC","NM",0,13,5164439,5164439,1,0,1,6540,6540,0,66775,0,null,null,null,9.7899999999999991,1782,14523,47255,0,5702,0,0,2249,{"$f":"IFERROR(VLOOKUP(B123, Info!$P$7:$P$1000, 1, FALSE)/VLOOKUP(B123, Info!$P$7:$P$1000, 1, FALSE), 0)","v":1},{"$f":"IFERROR(VLOOKUP(B123, Info!$Q$7:$Q$1000, 1, FALSE)/VLOOKUP(B123, Info!$Q$7:$Q$1000, 1, FALSE), 0)","v":0},{"$f":"IF(OR(P123=1, AH123=1, AI123=1), 1, 0)","v":1}]
[20210331,18296,915065,"HAWAII NATIONAL BANK",1,835713,"HI","OCC","N",0,14,1142439,1142439,0,0,1,66822,66822,72137,794390,424163,15.75,15.75,17.010000000000002,8.41,16021,172919,524585,0,100485,0,0,305,{"$f":"IFERROR(VLOOKUP(B124, Info!$P$7:$P$1000, 1, FALSE)/VLOOKUP(B124, Info!$P$7:$P$1000, 1, FALSE), 0)","v":0},{"$f":"IFERROR(VLOOKUP(B124, Info!$Q$7:$Q$1000, 1, FALSE)/VLOOKUP(B124, Info!$Q$7:$Q$1000, 1, FALSE), 0)","v":0},{"$f":"IF(OR(P124=1, AH124=1, AI124=1), 1, 0)","v":1}]
[20210331,18301,524766,"FIRST STATE BANK",1,113228,"TX","FDIC","NM",0,13,3361506,3361506,0,1,1,17756,17756,18710,106905,75274,23.59,23.59,24.86,16.61,8778,2352,72915,0,10836,0,0,2646,{"$f":"IFERROR(VLOOKUP(B125, Info!$P$7:$P$1000, 1, FALSE)/VLOOKUP(B125, Info!$P$7:$P$1000, 1, FALSE), 0)","v":0},{"$f":"IFERROR(VLOOKUP(B125, Info!$Q$7:$Q$1000, 1, FALSE)/VLOOKUP(B125, Info!$Q$7:$Q$1000, 1, FALSE), 0)","v":0},{"$f":"IF(OR(P125=1, AH125=1, AI125=1), 1, 0)","v":1}]
[20210331,18454,218261,"ZAPATA NATIONAL BANK",1,92155,"TX","OCC","N",0,13,1107223,2619479,1,1,1,11807,11807,0,90843,0,null,null,null,13,4087,33618,34727,0,18540,0,0,0,{"$f":"IFERROR(VLOOKUP(B126, Info!$P$7:$P$1000, 1, FALSE)/VLOOKUP(B126, Info!$P$7:$P$1000, 1, FALSE), 0)","v":0},{"$f":"IFERROR(VLOOKUP(B126, Info!$Q$7:$Q$1000, 1, FALSE)/VLOOKUP(B126, Info!$Q$7:$Q$1000, 1, FALSE), 0)","v":0},{"$f":"IF(OR(P126=1, AH126=1, AI126=1), 1, 0)","v":1}]
[20210331,18503,595869,"CATHAY BANK",1,19211723,"CA","FDIC","NM",0,14,1843080,1843080,0,0,1,2097197,2097197,2249431,18580822,14746920,14.22,14.22,15.25,11.29,141884,1610383,15403592,0,908844,7441,0,377438,{"$f":"IFERROR(VLOOKUP(B127, Info!$P$7:$P$1000, 1, FALSE)/VLOOKUP(B127, Info!$P$7:$P$1000, 1, FALSE), 0)","v":0},{"$f":"IFERROR(VLOOKUP(B127, Info!$Q$7:$Q$1000, 1, FALSE)/VLOOKUP(B127, Info!$Q$7:$Q$1000, 1, FALSE), 0)","v":0},{"$f":"IF(OR(P127=1, AH127=1, AI127=1), 1, 0)","v":1}]
[20210331,18561,860053,"SUNRISE BANKS, NATIONAL ASSOCIATION",1,1630566,"MN","OCC","N",0,11,1139103,1139103,0,1,0,110239,110239,122028,1358374,843283,13.07,13.07,14.47,8.1199999999999992,34532,181157,1159419,0,188759,0,0,85,{"$f":"IFERROR(VLOOKUP(B128, Info!$P$7:$P$1000, 1, FALSE)/VLOOKUP(B128, Info!$P$7:$P$1000, 1, FALSE), 0)","v":1},{"$f":"IFERROR(VLOOKUP(B128, Info!$Q$7:$Q$1000, 1, FALSE)/VLOOKUP(B128, Info!$Q$7:$Q$1000, 1, FALSE), 0)","v":0},{"$f":"IF(OR(P128=1, AH128=1, AI128=1), 1, 0)","v":1}]
[20210331,19024,794149,"COMMERCIAL NATIONAL BANK OF TEXARKANA",1,273285,"TX","OCC","N",0,13,1118818,1118818,0,1,0,21862,21862,23533,264669,155486,14.06,14.06,15.14,8.26,8204,26,167698,0,84022,0,0,0,{"$f":"IFERROR(VLOOKUP(B129, Info!$P$7:$P$1000, 1, FALSE)/VLOOKUP(B129, Info!$P$7:$P$1000, 1, FALSE), 0)","v":0},{"$f":"IFERROR(VLOOKUP(B129, Info!$Q$7:$Q$1000, 1, FALSE)/VLOOKUP(B129, Info!$Q$7:$Q$1000, 1, FALSE), 0)","v":1},{"$f":"IF(OR(P129=1, AH129=1, AI129=1), 1, 0)","v":1}]
[20210331,19143,90337,"UNITED COMMUNITY BANK",1,623941,"LA","FDIC","NM",0,13,1977154,1977154,1,1,0,84028,84028,0,615793,0,null,null,null,13.65,13243,70464,457444,0,56313,0,0,0,{"$f":"IFERROR(VLOOKUP(B130, Info!$P$7:$P$1000, 1, FALSE)/VLOOKUP(B130, Info!$P$7:$P$1000, 1, FALSE), 0)","v":1},{"$f":"IFERROR(VLOOKUP(B130, Info!$Q$7:$Q$1000, 1, FALSE)/VLOOKUP(B130, Info!$Q$7:$Q$1000, 1, FALSE), 0)","v":0},{"$f":"IF(OR(P130=1, AH130=1, AI130=1), 1, 0)","v":1}]
[20210331,19226,786340,"FIRST AMERICAN NATIONAL BANK",1,361532,"MS","OCC","N",0,13,3179877,3179877,1,1,0,34131,34131,0,344447,0,null,null,null,9.91,8267,14142,185532,6640,121501,0,0,6,{"$f":"IFERROR(VLOOKUP(B131, Info!$P$7:$P$1000, 1, FALSE)/VLOOKUP(B131, Info!$P$7:$P$1000, 1, FALSE), 0)","v":1},{"$f":"IFERROR(VLOOKUP(B131, Info!$Q$7:$Q$1000, 1, FALSE)/VLOOKUP(B131, Info!$Q$7:$Q$1000, 1, FALSE), 0)","v":0},{"$f":"IF(OR(P131=1, AH131=1, AI131=1), 1, 0)","v":1}]
[20210331,19349,991359,"FIRST MISSOURI BANK OF SEMO",1,208515,"MO","FDIC","NM",0,11,1491445,1491445,0,1,0,18726,18726,20455,208118,137413,13.63,13.63,14.89,9,2581,48929,149620,0,3196,0,0,0,{"$f":"IFERROR(VLOOKUP(B132, Info!$P$7:$P$1000, 1, FALSE)/VLOOKUP(B132, Info!$P$7:$P$1000, 1, FALSE), 0)","v":1},{"$f":"IFERROR(VLOOKUP(B132, Info!$Q$7:$Q$1000, 1, FALSE)/VLOOKUP(B132, Info!$Q$7:$Q$1000, 1, FALSE), 0)","v":0},{"$f":"IF(OR(P132=1, AH132=1, AI132=1), 1, 0)","v":1}]
[20210331,19416,996260,"CTBC BANK CORP. (USA)",1,3969104,"CA","FDIC","NM",0,14,3080209,1486517,1,0,1,564456,563956,0,3951218,0,null,null,null,14.29,6012,497282,3079085,29872,227289,0,0,568,{"$f":"IFERROR(VLOOKUP(B133, Info!$P$7:$P$1000, 1, FALSE)/VLOOKUP(B133, Info!$P$7:$P$1000, 1, FALSE), 0)","v":0},{"$f":"IFERROR(VLOOKUP(B133, Info!$Q$7:$Q$1000, 1, FALSE)/VLOOKUP(B133, Info!$Q$7:$Q$1000, 1, FALSE), 0)","v":0},{"$f":"IF(OR(P133=1, AH133=1, AI133=1), 1, 0)","v":1}]
[20210331,19448,916745,"BNA BANK",1,650768,"MS","FDIC","NM",0,13,3326176,3326176,0,0,0,70048,70048,75010,636305,395612,17.71,17.71,18.96,11.01,23060,2199,346960,58842,162902,0,0,289,{"$f":"IFERROR(VLOOKUP(B134, Info!$P$7:$P$1000, 1, FALSE)/VLOOKUP(B134, Info!$P$7:$P$1000, 1, FALSE), 0)","v":1},{"$f":"IFERROR(VLOOKUP(B134, Info!$Q$7:$Q$1000, 1, FALSE)/VLOOKUP(B134, Info!$Q$7:$Q$1000, 1, FALSE), 0)","v":0},{"$f":"IF(OR(P134=1, AH134=1, AI134=1), 1, 0)","v":1}]
[20210331,19629,1001152,"INTERNATIONAL BANK OF COMMERCE",1,10556686,"TX","FDIC","NM",0,13,1104231,1104231,0,0,1,1307429,1307429,1392439,10327415,7150465,18.28,18.28,19.47,12.66,251531,1637936,5716297,3125,1998049,0,0,227085,{"$f":"IFERROR(VLOOKUP(B135, Info!$P$7:$P$1000, 1, FALSE)/VLOOKUP(B135, Info!$P$7:$P$1000, 1, FALSE), 0)","v":0},{"$f":"IFERROR(VLOOKUP(B135, Info!$Q$7:$Q$1000, 1, FALSE)/VLOOKUP(B135, Info!$Q$7:$Q$1000, 1, FALSE), 0)","v":0},{"$f":"IF(OR(P135=1, AH135=1, AI135=1), 1, 0)","v":1}]
[20210331,19638,969255,"GUARANTY BANK & TRUST COMPANY OF DELHI, LOUISIANA",1,330912,"LA","FDIC","NM",0,13,1107090,1107090,0,1,0,27211,27211,29275,319127,186259,14.61,14.61,15.72,8.5299999999999994,10117,78670,220786,0,13962,0,0,0,{"$f":"IFERROR(VLOOKUP(B136, Info!$P$7:$P$1000, 1, FALSE)/VLOOKUP(B136, Info!$P$7:$P$1000, 1, FALSE), 0)","v":1},{"$f":"IFERROR(VLOOKUP(B136, Info!$Q$7:$Q$1000, 1, FALSE)/VLOOKUP(B136, Info!$Q$7:$Q$1000, 1, FALSE), 0)","v":0},{"$f":"IF(OR(P136=1, AH136=1, AI136=1), 1, 0)","v":1}]
[20210331,19644,848248,"FIDELITY BANK",1,500264,"AR","FED","SM",0,13,1491641,1491641,1,1,0,52053,52053,0,496456,0,null,null,null,10.48,2505,2831,207172,0,260177,45,0,0,{"$f":"IFERROR(VLOOKUP(B137, Info!$P$7:$P$1000, 1, FALSE)/VLOOKUP(B137, Info!$P$7:$P$1000, 1, FALSE), 0)","v":1},{"$f":"IFERROR(VLOOKUP(B137, Info!$Q$7:$Q$1000, 1, FALSE)/VLOOKUP(B137, Info!$Q$7:$Q$1000, 1, FALSE), 0)","v":0},{"$f":"IF(OR(P137=1, AH137=1, AI137=1), 1, 0)","v":1}]
[20210331,19800,89032,"PLAQUEMINE BANK & TRUST COMPANY",1,186290,"LA","FDIC","NM",0,13,1086355,1086355,0,0,0,19610,19610,20411,186131,89263,21.97,21.97,22.87,10.54,2852,44046,81974,6698,45404,0,0,0,{"$f":"IFERROR(VLOOKUP(B138, Info!$P$7:$P$1000, 1, FALSE)/VLOOKUP(B138, Info!$P$7:$P$1000, 1, FALSE), 0)","v":1},{"$f":"IFERROR(VLOOKUP(B138, Info!$Q$7:$Q$1000, 1, FALSE)/VLOOKUP(B138, Info!$Q$7:$Q$1000, 1, FALSE), 0)","v":0},{"$f":"IF(OR(P138=1, AH138=1, AI138=1), 1, 0)","v":1}]
[20210331,19819,563934,"SOUTHEAST FIRST NATIONAL BANK",1,73913,"GA","OCC","N",0,5,1133754,1133754,1,0,0,7288,7288,0,63856,0,null,null,null,11.41,653,34078,15442,21771,500,0,0,0,{"$f":"IFERROR(VLOOKUP(B139, Info!$P$7:$P$1000, 1, FALSE)/VLOOKUP(B139, Info!$P$7:$P$1000, 1, FALSE), 0)","v":0},{"$f":"IFERROR(VLOOKUP(B139, Info!$Q$7:$Q$1000, 1, FALSE)/VLOOKUP(B139, Info!$Q$7:$Q$1000, 1, FALSE), 0)","v":1},{"$f":"IF(OR(P139=1, AH139=1, AI139=1), 1, 0)","v":1}]
[20210331,19904,800853,"CENTINEL BANK OF TAOS",1,354741,"NM","FDIC","NM",0,13,1061754,1061754,0,1,1,27995,27995,29476,351072,118228,23.68,23.68,24.93,7.97,1227,32316,125322,0,189058,0,0,0,{"$f":"IFERROR(VLOOKUP(B140, Info!$P$7:$P$1000, 1, FALSE)/VLOOKUP(B140, Info!$P$7:$P$1000, 1, FALSE), 0)","v":0},{"$f":"IFERROR(VLOOKUP(B140, Info!$Q$7:$Q$1000, 1, FALSE)/VLOOKUP(B140, Info!$Q$7:$Q$1000, 1, FALSE), 0)","v":0},{"$f":"IF(OR(P140=1, AH140=1, AI140=1), 1, 0)","v":1}]
[20210331,20179,254849,"FIRST INDEPENDENCE BANK",1,323762,"MI","FDIC","NM",0,9,1134564,1134564,1,0,1,29677,26979,0,308931,0,null,null,null,9.61,2751,23964,162663,0,6475,0,0,0,{"$f":"IFERROR(VLOOKUP(B141, Info!$P$7:$P$1000, 1, FALSE)/VLOOKUP(B141, Info!$P$7:$P$1000, 1, FALSE), 0)","v":1},{"$f":"IFERROR(VLOOKUP(B141, Info!$Q$7:$Q$1000, 1, FALSE)/VLOOKUP(B141, Info!$Q$7:$Q$1000, 1, FALSE), 0)","v":0},{"$f":"IF(OR(P141=1, AH141=1, AI141=1), 1, 0)","v":1}]
[20210331,20198,767732,"SOUTH GEORGIA BANKING COMPANY",1,557316,"GA","FDIC","NM",0,5,2764977,2764977,0,0,0,56987,56987,61039,536460,344603,16.54,16.54,17.71,10.62,36451,66364,283216,0,93275,0,0,10397,{"$f":"IFERROR(VLOOKUP(B142, Info!$P$7:$P$1000, 1, FALSE)/VLOOKUP(B142, Info!$P$7:$P$1000, 1, FALSE), 0)","v":1},{"$f":"IFERROR(VLOOKUP(B142, Info!$Q$7:$Q$1000, 1, FALSE)/VLOOKUP(B142, Info!$Q$7:$Q$1000, 1, FALSE), 0)","v":0},{"$f":"IF(OR(P142=1, AH142=1, AI142=1), 1, 0)","v":1}]
[20210331,20387,777366,"BANK OF THE ORIENT",1,933293,"CA","FED","SM",0,14,1028533,1028533,1,0,1,101082,101082,0,923018,0,null,null,null,10.95,23503,163847,674847,528,29002,0,0,0,{"$f":"IFERROR(VLOOKUP(B143, Info!$P$7:$P$1000, 1, FALSE)/VLOOKUP(B143, Info!$P$7:$P$1000, 1, FALSE), 0)","v":0},{"$f":"IFERROR(VLOOKUP(B143, Info!$Q$7:$Q$1000, 1, FALSE)/VLOOKUP(B143, Info!$Q$7:$Q$1000, 1, FALSE), 0)","v":0},{"$f":"IF(OR(P143=1, AH143=1, AI143=1), 1, 0)","v":1}]
[20210331,20568,651121,"LUMBEE GUARANTY BANK",1,436434,"NC","FDIC","NM",0,5,null,null,1,0,1,44213,44213,0,428862,0,null,null,null,10.31,5364,38824,199643,89836,80276,0,0,634,{"$f":"IFERROR(VLOOKUP(B144, Info!$P$7:$P$1000, 1, FALSE)/VLOOKUP(B144, Info!$P$7:$P$1000, 1, FALSE), 0)","v":0},{"$f":"IFERROR(VLOOKUP(B144, Info!$Q$7:$Q$1000, 1, FALSE)/VLOOKUP(B144, Info!$Q$7:$Q$1000, 1, FALSE), 0)","v":0},{"$f":"IF(OR(P144=1, AH144=1, AI144=1), 1, 0)","v":1}]
[20210331,20845,283867,"WALLIS BANK",1,1311830,"TX","FDIC","NM",0,13,2693956,2693956,0,1,1,94830,94830,101501,1002462,798033,11.88,11.88,12.72,9.4600000000000009,37991,86488,1139049,0,8702,0,0,4178,{"$f":"IFERROR(VLOOKUP(B145, Info!$P$7:$P$1000, 1, FALSE)/VLOOKUP(B145, Info!$P$7:$P$1000, 1, FALSE), 0)","v":0},{"$f":"IFERROR(VLOOKUP(B145, Info!$Q$7:$Q$1000, 1, FALSE)/VLOOKUP(B145, Info!$Q$7:$Q$1000, 1, FALSE), 0)","v":0},{"$f":"IF(OR(P145=1, AH145=1, AI145=1), 1, 0)","v":1}]
[20210331,20856,283438,"LIBERTY BANK AND TRUST COMPANY",1,865742,"LA","FDIC","NM",0,13,1130548,1130548,0,0,1,80987,80987,86580,795713,539005,15.03,15.03,16.059999999999999,10.18,5454,183498,430648,1200,169255,0,0,360,{"$f":"IFERROR(VLOOKUP(B146, Info!$P$7:$P$1000, 1, FALSE)/VLOOKUP(B146, Info!$P$7:$P$1000, 1, FALSE), 0)","v":1},{"$f":"IFERROR(VLOOKUP(B146, Info!$Q$7:$Q$1000, 1, FALSE)/VLOOKUP(B146, Info!$Q$7:$Q$1000, 1, FALSE), 0)","v":0},{"$f":"IF(OR(P146=1, AH146=1, AI146=1), 1, 0)","v":1}]
[20210331,20884,711472,"BANK OF GUAM",1,2400620,"GU","FDIC","NM",0,14,4272869,4272869,0,0,1,179753,174753,198246,2421078,1461590,11.96,12.3,13.56,7.42,43819,277648,1346008,43082,532991,0,0,2603,{"$f":"IFERROR(VLOOKUP(B147, Info!$P$7:$P$1000, 1, FALSE)/VLOOKUP(B147, Info!$P$7:$P$1000, 1, FALSE), 0)","v":0},{"$f":"IFERROR(VLOOKUP(B147, Info!$Q$7:$Q$1000, 1, FALSE)/VLOOKUP(B147, Info!$Q$7:$Q$1000, 1, FALSE), 0)","v":0},{"$f":"IF(OR(P147=1, AH147=1, AI147=1), 1, 0)","v":1}]
[20210331,21083,544335,"UNITED MISSISSIPPI BANK",1,410350,"MS","FDIC","NM",0,13,1081686,1081686,1,1,0,39320,39320,0,401790,0,null,null,null,9.7899999999999991,12960,13333,292205,42551,34123,0,0,1300,{"$f":"IFERROR(VLOOKUP(B148, Info!$P$7:$P$1000, 1, FALSE)/VLOOKUP(B148, Info!$P$7:$P$1000, 1, FALSE), 0)","v":1},{"$f":"IFERROR(VLOOKUP(B148, Info!$Q$7:$Q$1000, 1, FALSE)/VLOOKUP(B148, Info!$Q$7:$Q$1000, 1, FALSE), 0)","v":0},{"$f":"IF(OR(P148=1, AH148=1, AI148=1), 1, 0)","v":1}]
[20210331,21379,78241,"FIRST NATURALSTATE BANK",1,81129,"AR","FED","SM",0,13,3386880,3386880,0,0,0,7412,7412,7954,78965,51372,14.43,14.43,15.48,9.39,1748,1994,50659,0,11975,0,0,0,{"$f":"IFERROR(VLOOKUP(B149, Info!$P$7:$P$1000, 1, FALSE)/VLOOKUP(B149, Info!$P$7:$P$1000, 1, FALSE), 0)","v":1},{"$f":"IFERROR(VLOOKUP(B149, Info!$Q$7:$Q$1000, 1, FALSE)/VLOOKUP(B149, Info!$Q$7:$Q$1000, 1, FALSE), 0)","v":0},{"$f":"IF(OR(P149=1, AH149=1, AI149=1), 1, 0)","v":1}]
[20210331,21567,494654,"AMERICAN BANK, NATIONAL ASSOCIATION",1,187022,"TX","OCC","N",0,13,5164448,5164448,1,0,1,14587,14587,0,141758,0,null,null,null,10.29,2028,36690,113610,0,21989,0,0,4217,{"$f":"IFERROR(VLOOKUP(B150, Info!$P$7:$P$1000, 1, FALSE)/VLOOKUP(B150, Info!$P$7:$P$1000, 1, FALSE), 0)","v":0},{"$f":"IFERROR(VLOOKUP(B150, Info!$Q$7:$Q$1000, 1, FALSE)/VLOOKUP(B150, Info!$Q$7:$Q$1000, 1, FALSE), 0)","v":0},{"$f":"IF(OR(P150=1, AH150=1, AI150=1), 1, 0)","v":1}]
[20210331,21906,956938,"PRIORITYONE BANK",1,841006,"MS","FDIC","NM",0,13,1084575,1084575,1,1,0,82815,82815,0,804464,0,null,null,null,10.29,18305,32947,617367,100919,30542,0,0,268,{"$f":"IFERROR(VLOOKUP(B151, Info!$P$7:$P$1000, 1, FALSE)/VLOOKUP(B151, Info!$P$7:$P$1000, 1, FALSE), 0)","v":1},{"$f":"IFERROR(VLOOKUP(B151, Info!$Q$7:$Q$1000, 1, FALSE)/VLOOKUP(B151, Info!$Q$7:$Q$1000, 1, FALSE), 0)","v":0},{"$f":"IF(OR(P151=1, AH151=1, AI151=1), 1, 0)","v":1}]
[20210331,21998,697035,"COVINGTON COUNTY BANK",1,85179,"MS","FDIC","NM",0,13,2228590,2228590,0,0,0,7677,7677,7853,92186,49120,15.63,15.63,15.99,8.33,2210,2498,42335,0,26280,0,0,0,{"$f":"IFERROR(VLOOKUP(B152, Info!$P$7:$P$1000, 1, FALSE)/VLOOKUP(B152, Info!$P$7:$P$1000, 1, FALSE), 0)","v":1},{"$f":"IFERROR(VLOOKUP(B152, Info!$Q$7:$Q$1000, 1, FALSE)/VLOOKUP(B152, Info!$Q$7:$Q$1000, 1, FALSE), 0)","v":0},{"$f":"IF(OR(P152=1, AH152=1, AI152=1), 1, 0)","v":1}]
[20210331,22020,329550,"INSOUTH BANK",1,403028,"TN","FED","SM",0,13,1100000,1100000,1,0,0,36310,36310,0,393456,0,null,null,null,9.23,5320,3715,313606,0,46536,0,0,0,{"$f":"IFERROR(VLOOKUP(B153, Info!$P$7:$P$1000, 1, FALSE)/VLOOKUP(B153, Info!$P$7:$P$1000, 1, FALSE), 0)","v":1},{"$f":"IFERROR(VLOOKUP(B153, Info!$Q$7:$Q$1000, 1, FALSE)/VLOOKUP(B153, Info!$Q$7:$Q$1000, 1, FALSE), 0)","v":0},{"$f":"IF(OR(P153=1, AH153=1, AI153=1), 1, 0)","v":1}]
[20210331,22081,34434,"MAGNOLIA STATE BANK",1,416356,"MS","FDIC","NM",0,13,1084016,1084016,0,1,0,34362,34362,36465,401687,269867,12.73,12.73,13.51,8.5500000000000007,9984,2148,275085,8271,30240,0,13,603,{"$f":"IFERROR(VLOOKUP(B154, Info!$P$7:$P$1000, 1, FALSE)/VLOOKUP(B154, Info!$P$7:$P$1000, 1, FALSE), 0)","v":1},{"$f":"IFERROR(VLOOKUP(B154, Info!$Q$7:$Q$1000, 1, FALSE)/VLOOKUP(B154, Info!$Q$7:$Q$1000, 1, FALSE), 0)","v":0},{"$f":"IF(OR(P154=1, AH154=1, AI154=1), 1, 0)","v":1}]
[20210331,22217,635457,"LAKESIDE STATE BANK",1,86790,"OK","FDIC","NM",0,13,1059797,1059797,1,1,1,6760,6760,0,79974,0,null,null,null,8.4499999999999993,1461,591,25927,0,18752,0,0,4607,{"$f":"IFERROR(VLOOKUP(B155, Info!$P$7:$P$1000, 1, FALSE)/VLOOKUP(B155, Info!$P$7:$P$1000, 1, FALSE), 0)","v":0},{"$f":"IFERROR(VLOOKUP(B155, Info!$Q$7:$Q$1000, 1, FALSE)/VLOOKUP(B155, Info!$Q$7:$Q$1000, 1, FALSE), 0)","v":0},{"$f":"IF(OR(P155=1, AH155=1, AI155=1), 1, 0)","v":1}]
[20210331,22229,578237,"COMMONWEALTH NATIONAL BANK",1,57759,"AL","OCC","N",0,5,3635328,3635328,0,0,1,6780,6780,7057,57069,21803,31.1,31.1,32.369999999999997,11.88,10621,10082,19585,0,15982,0,0,0,{"$f":"IFERROR(VLOOKUP(B156, Info!$P$7:$P$1000, 1, FALSE)/VLOOKUP(B156, Info!$P$7:$P$1000, 1, FALSE), 0)","v":1},{"$f":"IFERROR(VLOOKUP(B156, Info!$Q$7:$Q$1000, 1, FALSE)/VLOOKUP(B156, Info!$Q$7:$Q$1000, 1, FALSE), 0)","v":0},{"$f":"IF(OR(P156=1, AH156=1, AI156=1), 1, 0)","v":1}]
[20210331,22319,397755,"LEGACY BANK & TRUST COMPANY",1,638343,"MO","FED","SM",0,11,1095469,3157017,0,0,0,58903,58903,64200,584189,422406,13.94,13.94,15.2,10.08,7829,111366,491916,0,425,0,0,3618,{"$f":"IFERROR(VLOOKUP(B157, Info!$P$7:$P$1000, 1, FALSE)/VLOOKUP(B157, Info!$P$7:$P$1000, 1, FALSE), 0)","v":1},{"$f":"IFERROR(VLOOKUP(B157, Info!$Q$7:$Q$1000, 1, FALSE)/VLOOKUP(B157, Info!$Q$7:$Q$1000, 1, FALSE), 0)","v":0},{"$f":"IF(OR(P157=1, AH157=1, AI157=1), 1, 0)","v":1}]
[20210331,22394,784159,"PEOPLES COMMUNITY BANK",1,593569,"MO","FDIC","NM",0,11,1119431,1119431,1,1,0,99460,99460,0,574219,0,null,null,null,17.32,13511,29828,397653,0,124407,0,0,2989,{"$f":"IFERROR(VLOOKUP(B158, Info!$P$7:$P$1000, 1, FALSE)/VLOOKUP(B158, Info!$P$7:$P$1000, 1, FALSE), 0)","v":1},{"$f":"IFERROR(VLOOKUP(B158, Info!$Q$7:$Q$1000, 1, FALSE)/VLOOKUP(B158, Info!$Q$7:$Q$1000, 1, FALSE), 0)","v":0},{"$f":"IF(OR(P158=1, AH158=1, AI158=1), 1, 0)","v":1}]
[20210331,22657,804860,"CITIZENS STATE BANK",1,90464,"TX","FDIC","NM",0,13,null,null,0,0,1,8277,8277,8788,88901,40868,20.25,20.25,21.5,9.31,2625,7529,40966,4469,29045,0,0,0,{"$f":"IFERROR(VLOOKUP(B159, Info!$P$7:$P$1000, 1, FALSE)/VLOOKUP(B159, Info!$P$7:$P$1000, 1, FALSE), 0)","v":0},{"$f":"IFERROR(VLOOKUP(B159, Info!$Q$7:$Q$1000, 1, FALSE)/VLOOKUP(B159, Info!$Q$7:$Q$1000, 1, FALSE), 0)","v":0},{"$f":"IF(OR(P159=1, AH159=1, AI159=1), 1, 0)","v":1}]
[20210331,22739,364430,"BANK OF ST. FRANCISVILLE",1,197100,"LA","FDIC","NM",0,13,1082544,1082544,1,1,0,17422,17422,0,181078,0,null,null,null,9.6199999999999992,8046,2558,149746,0,12729,0,0,0,{"$f":"IFERROR(VLOOKUP(B160, Info!$P$7:$P$1000, 1, FALSE)/VLOOKUP(B160, Info!$P$7:$P$1000, 1, FALSE), 0)","v":1},{"$f":"IFERROR(VLOOKUP(B160, Info!$Q$7:$Q$1000, 1, FALSE)/VLOOKUP(B160, Info!$Q$7:$Q$1000, 1, FALSE), 0)","v":0},{"$f":"IF(OR(P160=1, AH160=1, AI160=1), 1, 0)","v":1}]
[20210331,23086,300063,"NEW OMNI BANK, NATIONAL ASSOCIATION",1,568322,"CA","OCC","N",0,14,4357252,4357252,0,0,1,76790,75140,81285,573636,358151,20.98,21.44,22.7,13.39,1296,110012,449278,0,1932,0,0,710,{"$f":"IFERROR(VLOOKUP(B161, Info!$P$7:$P$1000, 1, FALSE)/VLOOKUP(B161, Info!$P$7:$P$1000, 1, FALSE), 0)","v":0},{"$f":"IFERROR(VLOOKUP(B161, Info!$Q$7:$Q$1000, 1, FALSE)/VLOOKUP(B161, Info!$Q$7:$Q$1000, 1, FALSE), 0)","v":0},{"$f":"IF(OR(P161=1, AH161=1, AI161=1), 1, 0)","v":1}]
[20210331,23242,50461,"CALIFORNIA PACIFIC BANK",1,81889,"CA","FDIC","NM",0,14,null,null,0,0,1,34767,34767,35618,83515,64164,54.18,54.18,55.51,41.63,186,16612,52911,0,0,0,0,0,{"$f":"IFERROR(VLOOKUP(B162, Info!$P$7:$P$1000, 1, FALSE)/VLOOKUP(B162, Info!$P$7:$P$1000, 1, FALSE), 0)","v":0},{"$f":"IFERROR(VLOOKUP(B162, Info!$Q$7:$Q$1000, 1, FALSE)/VLOOKUP(B162, Info!$Q$7:$Q$1000, 1, FALSE), 0)","v":0},{"$f":"IF(OR(P162=1, AH162=1, AI162=1), 1, 0)","v":1}]
[20210331,23373,70218,"UNITED ORIENT BANK",1,88967,"NY","FDIC","NM",0,2,null,null,1,0,1,13391,13391,0,86672,0,null,null,null,15.45,1223,12469,71584,0,2006,0,0,0,{"$f":"IFERROR(VLOOKUP(B163, Info!$P$7:$P$1000, 1, FALSE)/VLOOKUP(B163, Info!$P$7:$P$1000, 1, FALSE), 0)","v":0},{"$f":"IFERROR(VLOOKUP(B163, Info!$Q$7:$Q$1000, 1, FALSE)/VLOOKUP(B163, Info!$Q$7:$Q$1000, 1, FALSE), 0)","v":0},{"$f":"IF(OR(P163=1, AH163=1, AI163=1), 1, 0)","v":1}]
[20210331,23749,519360,"MISSION NATIONAL BANK",1,220457,"CA","OCC","N",0,14,3195297,3195297,1,0,1,37185,37185,0,223418,0,null,null,null,16.64,19370,39521,146658,0,0,0,0,0,{"$f":"IFERROR(VLOOKUP(B164, Info!$P$7:$P$1000, 1, FALSE)/VLOOKUP(B164, Info!$P$7:$P$1000, 1, FALSE), 0)","v":1},{"$f":"IFERROR(VLOOKUP(B164, Info!$Q$7:$Q$1000, 1, FALSE)/VLOOKUP(B164, Info!$Q$7:$Q$1000, 1, FALSE), 0)","v":0},{"$f":"IF(OR(P164=1, AH164=1, AI164=1), 1, 0)","v":1}]
[20210331,23772,625159,"COMMERCE BANK",1,601905,"TX","FDIC","NM",0,13,1104231,1104231,0,0,1,96747,96747,99472,568586,225992,42.81,42.81,44.02,17.02,11724,6,189618,175,369738,2989,0,7094,{"$f":"IFERROR(VLOOKUP(B165, Info!$P$7:$P$1000, 1, FALSE)/VLOOKUP(B165, Info!$P$7:$P$1000, 1, FALSE), 0)","v":0},{"$f":"IFERROR(VLOOKUP(B165, Info!$Q$7:$Q$1000, 1, FALSE)/VLOOKUP(B165, Info!$Q$7:$Q$1000, 1, FALSE), 0)","v":0},{"$f":"IF(OR(P165=1, AH165=1, AI165=1), 1, 0)","v":1}]
[20210331,23805,609467,"UNITED PACIFIC BANK",1,183287,"CA","FDIC","NM",0,14,null,null,0,0,1,25858,23858,27319,179129,115590,20.64,22.37,23.63,14.44,1209,55452,126373,0,186,0,0,586,{"$f":"IFERROR(VLOOKUP(B166, Info!$P$7:$P$1000, 1, FALSE)/VLOOKUP(B166, Info!$P$7:$P$1000, 1, FALSE), 0)","v":0},{"$f":"IFERROR(VLOOKUP(B166, Info!$Q$7:$Q$1000, 1, FALSE)/VLOOKUP(B166, Info!$Q$7:$Q$1000, 1, FALSE), 0)","v":0},{"$f":"IF(OR(P166=1, AH166=1, AI166=1), 1, 0)","v":1}]
[20210331,23966,935308,"ONEUNITED BANK",1,652946,"MA","FDIC","NM",0,14,null,null,0,0,1,36852,24789,38659,629621,286506,8.65,12.86,13.49,5.85,4907,101157,389310,0,129087,2814,0,130,{"$f":"IFERROR(VLOOKUP(B167, Info!$P$7:$P$1000, 1, FALSE)/VLOOKUP(B167, Info!$P$7:$P$1000, 1, FALSE), 0)","v":1},{"$f":"IFERROR(VLOOKUP(B167, Info!$Q$7:$Q$1000, 1, FALSE)/VLOOKUP(B167, Info!$Q$7:$Q$1000, 1, FALSE), 0)","v":0},{"$f":"IF(OR(P167=1, AH167=1, AI167=1), 1, 0)","v":1}]
[20210331,24015,533124,"THE HARBOR BANK OF MARYLAND",1,338082,"MD","FDIC","NM",0,2,2008130,2008130,0,0,1,20918,20918,23215,291900,183491,11.4,11.4,12.65,7.17,3723,63398,214589,0,35275,0,0,0,{"$f":"IFERROR(VLOOKUP(B168, Info!$P$7:$P$1000, 1, FALSE)/VLOOKUP(B168, Info!$P$7:$P$1000, 1, FALSE), 0)","v":1},{"$f":"IFERROR(VLOOKUP(B168, Info!$Q$7:$Q$1000, 1, FALSE)/VLOOKUP(B168, Info!$Q$7:$Q$1000, 1, FALSE), 0)","v":0},{"$f":"IF(OR(P168=1, AH168=1, AI168=1), 1, 0)","v":1}]
[20210331,24156,663834,"OCEAN BANK",1,4704177,"FL","FDIC","NM",0,5,1136661,1136661,0,0,1,510438,510438,558835,4558942,3851965,13.25,13.25,14.51,11.2,37579,366730,3737679,0,380531,1964,0,1532,{"$f":"IFERROR(VLOOKUP(B169, Info!$P$7:$P$1000, 1, FALSE)/VLOOKUP(B169, Info!$P$7:$P$1000, 1, FALSE), 0)","v":0},{"$f":"IFERROR(VLOOKUP(B169, Info!$Q$7:$Q$1000, 1, FALSE)/VLOOKUP(B169, Info!$Q$7:$Q$1000, 1, FALSE), 0)","v":0},{"$f":"IF(OR(P169=1, AH169=1, AI169=1), 1, 0)","v":1}]
[20210331,24170,657365,"HANMI BANK",1,6437470,"CA","FDIC","NM",0,14,2900261,2900261,0,0,1,682137,682137,743137,6205796,4870177,14.01,14.01,15.26,10.99,55136,591309,4849825,0,780114,0,1354,17708,{"$f":"IFERROR(VLOOKUP(B170, Info!$P$7:$P$1000, 1, FALSE)/VLOOKUP(B170, Info!$P$7:$P$1000, 1, FALSE), 0)","v":0},{"$f":"IFERROR(VLOOKUP(B170, Info!$Q$7:$Q$1000, 1, FALSE)/VLOOKUP(B170, Info!$Q$7:$Q$1000, 1, FALSE), 0)","v":0},{"$f":"IF(OR(P170=1, AH170=1, AI170=1), 1, 0)","v":1}]
[20210331,24211,209362,"BANK OF WHITTIER, NATIONAL ASSOCIATION",1,134751,"CA","OCC","N",0,14,1398692,1398692,1,0,1,17432,17432,0,123649,0,null,null,null,14.1,950,89731,39915,0,0,0,0,2496,{"$f":"IFERROR(VLOOKUP(B171, Info!$P$7:$P$1000, 1, FALSE)/VLOOKUP(B171, Info!$P$7:$P$1000, 1, FALSE), 0)","v":0},{"$f":"IFERROR(VLOOKUP(B171, Info!$Q$7:$Q$1000, 1, FALSE)/VLOOKUP(B171, Info!$Q$7:$Q$1000, 1, FALSE), 0)","v":0},{"$f":"IF(OR(P171=1, AH171=1, AI171=1), 1, 0)","v":1}]
[20210331,24347,842460,"LONE STAR NATIONAL BANK",1,2737786,"TX","OCC","N",0,13,2325350,2325350,1,0,1,287114,287114,0,2614753,0,null,null,null,10.98,34273,411275,1305259,0,852598,0,0,1240,{"$f":"IFERROR(VLOOKUP(B172, Info!$P$7:$P$1000, 1, FALSE)/VLOOKUP(B172, Info!$P$7:$P$1000, 1, FALSE), 0)","v":0},{"$f":"IFERROR(VLOOKUP(B172, Info!$Q$7:$Q$1000, 1, FALSE)/VLOOKUP(B172, Info!$Q$7:$Q$1000, 1, FALSE), 0)","v":0},{"$f":"IF(OR(P172=1, AH172=1, AI172=1), 1, 0)","v":1}]
[20210331,24443,675855,"PROGRESSIVE NATIONAL BANK",1,98787,"LA","OCC","N",0,13,1108985,1108985,0,1,0,7535,7535,7857,95658,48500,15.54,15.54,16.2,7.88,2921,24986,51120,0,14116,0,0,0,{"$f":"IFERROR(VLOOKUP(B173, Info!$P$7:$P$1000, 1, FALSE)/VLOOKUP(B173, Info!$P$7:$P$1000, 1, FALSE), 0)","v":1},{"$f":"IFERROR(VLOOKUP(B173, Info!$Q$7:$Q$1000, 1, FALSE)/VLOOKUP(B173, Info!$Q$7:$Q$1000, 1, FALSE), 0)","v":0},{"$f":"IF(OR(P173=1, AH173=1, AI173=1), 1, 0)","v":1}]
[20210331,24823,867632,"INTERNATIONAL FINANCE BANK",1,876246,"FL","FDIC","NM",0,5,5419205,5419205,0,0,1,70412,70412,78078,850112,613246,11.48,11.48,12.73,8.2799999999999994,1601,120280,708474,0,42594,1490,0,1209,{"$f":"IFERROR(VLOOKUP(B174, Info!$P$7:$P$1000, 1, FALSE)/VLOOKUP(B174, Info!$P$7:$P$1000, 1, FALSE), 0)","v":0},{"$f":"IFERROR(VLOOKUP(B174, Info!$Q$7:$Q$1000, 1, FALSE)/VLOOKUP(B174, Info!$Q$7:$Q$1000, 1, FALSE), 0)","v":0},{"$f":"IF(OR(P174=1, AH174=1, AI174=1), 1, 0)","v":1}]
[20210331,24920,384018,"WOORI AMERICA BANK",1,2474286,"NY","FDIC","NM",0,2,5309306,1242834,1,0,1,294231,294231,0,2375791,0,null,null,null,12.38,20320,264963,1943956,29945,165942,1973,0,1927,{"$f":"IFERROR(VLOOKUP(B175, Info!$P$7:$P$1000, 1, FALSE)/VLOOKUP(B175, Info!$P$7:$P$1000, 1, FALSE), 0)","v":0},{"$f":"IFERROR(VLOOKUP(B175, Info!$Q$7:$Q$1000, 1, FALSE)/VLOOKUP(B175, Info!$Q$7:$Q$1000, 1, FALSE), 0)","v":0},{"$f":"IF(OR(P175=1, AH175=1, AI175=1), 1, 0)","v":1}]
[20210331,24961,382069,"INTERNATIONAL BANK OF COMMERCE",1,476732,"TX","FDIC","NM",0,13,1104231,1104231,0,0,1,72214,72214,74133,438447,187299,38.56,38.56,39.58,16.47,18032,4,142285,0,284510,2994,0,4771,{"$f":"IFERROR(VLOOKUP(B176, Info!$P$7:$P$1000, 1, FALSE)/VLOOKUP(B176, Info!$P$7:$P$1000, 1, FALSE), 0)","v":0},{"$f":"IFERROR(VLOOKUP(B176, Info!$Q$7:$Q$1000, 1, FALSE)/VLOOKUP(B176, Info!$Q$7:$Q$1000, 1, FALSE), 0)","v":0},{"$f":"IF(OR(P176=1, AH176=1, AI176=1), 1, 0)","v":1}]
[20210331,25158,827560,"FINANCE FACTORS, LTD.",1,580625,"HI","FDIC","NM",0,14,null,null,0,0,1,72228,72228,77328,572349,401098,18.010000000000002,18.010000000000002,19.28,12.62,17268,22658,387525,0,70749,0,13763,330,{"$f":"IFERROR(VLOOKUP(B177, Info!$P$7:$P$1000, 1, FALSE)/VLOOKUP(B177, Info!$P$7:$P$1000, 1, FALSE), 0)","v":0},{"$f":"IFERROR(VLOOKUP(B177, Info!$Q$7:$Q$1000, 1, FALSE)/VLOOKUP(B177, Info!$Q$7:$Q$1000, 1, FALSE), 0)","v":0},{"$f":"IF(OR(P177=1, AH177=1, AI177=1), 1, 0)","v":1}]
[20210331,25644,403067,"BEACON BUSINESS BANK, NATIONAL ASSOCIATION",1,162358,"CA","OCC","N",0,14,1031515,1031515,0,1,0,16729,16729,17745,155278,78767,21.24,21.24,22.53,10.77,2320,45281,94908,0,20235,0,0,653,{"$f":"IFERROR(VLOOKUP(B178, Info!$P$7:$P$1000, 1, FALSE)/VLOOKUP(B178, Info!$P$7:$P$1000, 1, FALSE), 0)","v":0},{"$f":"IFERROR(VLOOKUP(B178, Info!$Q$7:$Q$1000, 1, FALSE)/VLOOKUP(B178, Info!$Q$7:$Q$1000, 1, FALSE), 0)","v":1},{"$f":"IF(OR(P178=1, AH178=1, AI178=1), 1, 0)","v":1}]
[20210331,25679,230759,"INTERNATIONAL BANK OF COMMERCE",1,1464839,"TX","FDIC","NM",0,13,1104231,1104231,0,0,1,196223,196223,206111,1362684,790086,24.84,24.84,26.09,14.4,39860,9,674492,100,673703,0,0,1962,{"$f":"IFERROR(VLOOKUP(B179, Info!$P$7:$P$1000, 1, FALSE)/VLOOKUP(B179, Info!$P$7:$P$1000, 1, FALSE), 0)","v":0},{"$f":"IFERROR(VLOOKUP(B179, Info!$Q$7:$Q$1000, 1, FALSE)/VLOOKUP(B179, Info!$Q$7:$Q$1000, 1, FALSE), 0)","v":0},{"$f":"IF(OR(P179=1, AH179=1, AI179=1), 1, 0)","v":1}]
[20210331,25738,396253,"FIRST NATIONAL BANK AND TRUST COMPANY",1,320428,"OK","OCC","N",0,13,null,null,0,0,1,39327,39327,40808,309112,156646,25.11,25.11,26.05,12.72,4922,15789,114846,0,95238,44,0,2756,{"$f":"IFERROR(VLOOKUP(B180, Info!$P$7:$P$1000, 1, FALSE)/VLOOKUP(B180, Info!$P$7:$P$1000, 1, FALSE), 0)","v":0},{"$f":"IFERROR(VLOOKUP(B180, Info!$Q$7:$Q$1000, 1, FALSE)/VLOOKUP(B180, Info!$Q$7:$Q$1000, 1, FALSE), 0)","v":0},{"$f":"IF(OR(P180=1, AH180=1, AI180=1), 1, 0)","v":1}]
[20210331,25749,98717,"EASTBANK, NATIONAL ASSOCIATION",1,163838,"NY","OCC","N",0,2,2698906,1249459,0,0,1,33552,33552,34931,161721,109424,30.66,30.66,31.92,20.75,1315,39224,99005,0,18781,0,0,0,{"$f":"IFERROR(VLOOKUP(B181, Info!$P$7:$P$1000, 1, FALSE)/VLOOKUP(B181, Info!$P$7:$P$1000, 1, FALSE), 0)","v":0},{"$f":"IFERROR(VLOOKUP(B181, Info!$Q$7:$Q$1000, 1, FALSE)/VLOOKUP(B181, Info!$Q$7:$Q$1000, 1, FALSE), 0)","v":0},{"$f":"IF(OR(P181=1, AH181=1, AI181=1), 1, 0)","v":1}]
[20210331,25869,534466,"METROPOLITAN BANK",1,198635,"CA","FDIC","NM",0,14,1139439,1139439,1,0,1,22582,22582,0,190394,0,null,null,null,11.86,820,28652,162497,0,4515,0,0,0,{"$f":"IFERROR(VLOOKUP(B182, Info!$P$7:$P$1000, 1, FALSE)/VLOOKUP(B182, Info!$P$7:$P$1000, 1, FALSE), 0)","v":0},{"$f":"IFERROR(VLOOKUP(B182, Info!$Q$7:$Q$1000, 1, FALSE)/VLOOKUP(B182, Info!$Q$7:$Q$1000, 1, FALSE), 0)","v":0},{"$f":"IF(OR(P182=1, AH182=1, AI182=1), 1, 0)","v":1}]
[20210331,25883,759045,"FIRST EAGLE BANK",1,596906,"IL","FED","SM",0,9,1492956,1492956,1,1,0,100783,100783,0,578244,0,null,null,null,17.43,25036,1225,384161,0,168835,0,0,1303,{"$f":"IFERROR(VLOOKUP(B183, Info!$P$7:$P$1000, 1, FALSE)/VLOOKUP(B183, Info!$P$7:$P$1000, 1, FALSE), 0)","v":1},{"$f":"IFERROR(VLOOKUP(B183, Info!$Q$7:$Q$1000, 1, FALSE)/VLOOKUP(B183, Info!$Q$7:$Q$1000, 1, FALSE), 0)","v":0},{"$f":"IF(OR(P183=1, AH183=1, AI183=1), 1, 0)","v":1}]
[20210331,25886,956750,"RIO BANK",1,703630,"TX","FDIC","NM",0,13,3193033,3193033,0,0,1,62297,62297,66108,662383,448997,13.87,13.87,14.72,9.4,17943,35723,372045,0,190805,0,7523,8595,{"$f":"IFERROR(VLOOKUP(B184, Info!$P$7:$P$1000, 1, FALSE)/VLOOKUP(B184, Info!$P$7:$P$1000, 1, FALSE), 0)","v":0},{"$f":"IFERROR(VLOOKUP(B184, Info!$Q$7:$Q$1000, 1, FALSE)/VLOOKUP(B184, Info!$Q$7:$Q$1000, 1, FALSE), 0)","v":0},{"$f":"IF(OR(P184=1, AH184=1, AI184=1), 1, 0)","v":1}]
[20210331,26181,739355,"TEXAS NATIONAL BANK OF JACKSONVILLE",1,668960,"TX","OCC","N",0,13,2716471,2716471,0,0,0,64037,64037,69802,649568,459795,13.93,13.93,15.18,9.86,8914,77770,544877,0,24079,0,0,114,{"$f":"IFERROR(VLOOKUP(B185, Info!$P$7:$P$1000, 1, FALSE)/VLOOKUP(B185, Info!$P$7:$P$1000, 1, FALSE), 0)","v":0},{"$f":"IFERROR(VLOOKUP(B185, Info!$Q$7:$Q$1000, 1, FALSE)/VLOOKUP(B185, Info!$Q$7:$Q$1000, 1, FALSE), 0)","v":1},{"$f":"IF(OR(P185=1, AH185=1, AI185=1), 1, 0)","v":1}]
[20210331,26223,536059,"GOLDEN BANK, NATIONAL ASSOCIATION",1,1263692,"TX","OCC","N",0,13,null,null,0,0,1,155628,155628,167354,1197619,950003,16.38,16.38,17.62,12.99,10264,164400,947657,0,102045,5837,0,1011,{"$f":"IFERROR(VLOOKUP(B186, Info!$P$7:$P$1000, 1, FALSE)/VLOOKUP(B186, Info!$P$7:$P$1000, 1, FALSE), 0)","v":1},{"$f":"IFERROR(VLOOKUP(B186, Info!$Q$7:$Q$1000, 1, FALSE)/VLOOKUP(B186, Info!$Q$7:$Q$1000, 1, FALSE), 0)","v":0},{"$f":"IF(OR(P186=1, AH186=1, AI186=1), 1, 0)","v":1}]
[20210331,26351,853251,"UNITY NATIONAL BANK OF HOUSTON",1,187172,"TX","OCC","N",0,13,null,null,1,0,1,18610,10653,0,175403,0,null,null,null,10.61,2234,6323,140308,0,22641,0,0,0,{"$f":"IFERROR(VLOOKUP(B187, Info!$P$7:$P$1000, 1, FALSE)/VLOOKUP(B187, Info!$P$7:$P$1000, 1, FALSE), 0)","v":0},{"$f":"IFERROR(VLOOKUP(B187, Info!$Q$7:$Q$1000, 1, FALSE)/VLOOKUP(B187, Info!$Q$7:$Q$1000, 1, FALSE), 0)","v":0},{"$f":"IF(OR(P187=1, AH187=1, AI187=1), 1, 0)","v":1}]
[20210331,26363,299868,"COMMUNITY COMMERCE BANK",1,325294,"CA","FDIC","NM",0,14,null,null,0,0,1,54635,54635,57562,328923,234133,23.34,23.34,24.59,16.61,4354,44868,240121,115,0,0,0,0,{"$f":"IFERROR(VLOOKUP(B188, Info!$P$7:$P$1000, 1, FALSE)/VLOOKUP(B188, Info!$P$7:$P$1000, 1, FALSE), 0)","v":1},{"$f":"IFERROR(VLOOKUP(B188, Info!$Q$7:$Q$1000, 1, FALSE)/VLOOKUP(B188, Info!$Q$7:$Q$1000, 1, FALSE), 0)","v":0},{"$f":"IF(OR(P188=1, AH188=1, AI188=1), 1, 0)","v":1}]
[20210331,26379,880332,"PIKE NATIONAL BANK",1,307788,"MS","OCC","N",0,13,3447428,3447428,0,0,0,37065,37065,39313,296644,179485,20.65,20.65,21.9,12.49,7778,26297,168432,19519,68003,0,0,0,{"$f":"IFERROR(VLOOKUP(B189, Info!$P$7:$P$1000, 1, FALSE)/VLOOKUP(B189, Info!$P$7:$P$1000, 1, FALSE), 0)","v":1},{"$f":"IFERROR(VLOOKUP(B189, Info!$Q$7:$Q$1000, 1, FALSE)/VLOOKUP(B189, Info!$Q$7:$Q$1000, 1, FALSE), 0)","v":0},{"$f":"IF(OR(P189=1, AH189=1, AI189=1), 1, 0)","v":1}]
[20210331,26564,975256,"DELTA BANK",1,427965,"LA","FDIC","NM",0,13,1109571,1109571,1,1,0,31188,31188,0,411841,0,null,null,null,7.57,7370,69255,269098,13936,62201,79,0,0,{"$f":"IFERROR(VLOOKUP(B190, Info!$P$7:$P$1000, 1, FALSE)/VLOOKUP(B190, Info!$P$7:$P$1000, 1, FALSE), 0)","v":1},{"$f":"IFERROR(VLOOKUP(B190, Info!$Q$7:$Q$1000, 1, FALSE)/VLOOKUP(B190, Info!$Q$7:$Q$1000, 1, FALSE), 0)","v":0},{"$f":"IF(OR(P190=1, AH190=1, AI190=1), 1, 0)","v":1}]
[20210331,26610,671464,"BANK OF HOPE",1,17193404,"CA","FDIC","NM",0,14,2961879,2961879,0,0,1,1878164,1878164,2057352,16630011,14332660,13.1,13.1,14.35,11.29,138149,326863,13722301,0,2233745,27128,0,485732,{"$f":"IFERROR(VLOOKUP(B191, Info!$P$7:$P$1000, 1, FALSE)/VLOOKUP(B191, Info!$P$7:$P$1000, 1, FALSE), 0)","v":0},{"$f":"IFERROR(VLOOKUP(B191, Info!$Q$7:$Q$1000, 1, FALSE)/VLOOKUP(B191, Info!$Q$7:$Q$1000, 1, FALSE), 0)","v":0},{"$f":"IF(OR(P191=1, AH191=1, AI191=1), 1, 0)","v":1}]
[20210331,26727,49858,"BANK OF SOUTH TEXAS",1,136305,"TX","FDIC","NM",0,13,null,null,1,0,1,15454,15454,0,132909,0,null,null,null,11.63,4620,23037,90072,0,5891,0,0,3480,{"$f":"IFERROR(VLOOKUP(B192, Info!$P$7:$P$1000, 1, FALSE)/VLOOKUP(B192, Info!$P$7:$P$1000, 1, FALSE), 0)","v":0},{"$f":"IFERROR(VLOOKUP(B192, Info!$Q$7:$Q$1000, 1, FALSE)/VLOOKUP(B192, Info!$Q$7:$Q$1000, 1, FALSE), 0)","v":0},{"$f":"IF(OR(P192=1, AH192=1, AI192=1), 1, 0)","v":1}]
[20210331,26790,609609,"KEB HANA BANK USA, NATIONAL ASSOCIATION",1,260817,"NJ","OCC","N",0,2,3400937,1398973,0,0,1,33136,33136,35028,264085,150676,21.99,21.99,23.25,12.55,3338,50376,173832,21764,8493,0,0,51,{"$f":"IFERROR(VLOOKUP(B193, Info!$P$7:$P$1000, 1, FALSE)/VLOOKUP(B193, Info!$P$7:$P$1000, 1, FALSE), 0)","v":0},{"$f":"IFERROR(VLOOKUP(B193, Info!$Q$7:$Q$1000, 1, FALSE)/VLOOKUP(B193, Info!$Q$7:$Q$1000, 1, FALSE), 0)","v":0},{"$f":"IF(OR(P193=1, AH193=1, AI193=1), 1, 0)","v":1}]
[20210331,26856,564557,"FALCON INTERNATIONAL BANK",1,1650813,"TX","FDIC","NM",0,13,2270254,2270254,0,0,1,182398,182398,195297,1618526,1031730,17.68,17.68,18.93,11.27,22567,246975,943159,0,335510,26346,0,0,{"$f":"IFERROR(VLOOKUP(B194, Info!$P$7:$P$1000, 1, FALSE)/VLOOKUP(B194, Info!$P$7:$P$1000, 1, FALSE), 0)","v":0},{"$f":"IFERROR(VLOOKUP(B194, Info!$Q$7:$Q$1000, 1, FALSE)/VLOOKUP(B194, Info!$Q$7:$Q$1000, 1, FALSE), 0)","v":0},{"$f":"IF(OR(P194=1, AH194=1, AI194=1), 1, 0)","v":1}]
[20210331,27026,664653,"NATIVE AMERICAN BANK, NATIONAL ASSOCIATION",1,200755,"CO","OCC","N",0,13,2943419,2943419,1,0,1,14325,14325,0,166833,0,null,null,null,8.59,1000,24283,156126,0,6446,0,0,10,{"$f":"IFERROR(VLOOKUP(B195, Info!$P$7:$P$1000, 1, FALSE)/VLOOKUP(B195, Info!$P$7:$P$1000, 1, FALSE), 0)","v":1},{"$f":"IFERROR(VLOOKUP(B195, Info!$Q$7:$Q$1000, 1, FALSE)/VLOOKUP(B195, Info!$Q$7:$Q$1000, 1, FALSE), 0)","v":0},{"$f":"IF(OR(P195=1, AH195=1, AI195=1), 1, 0)","v":1}]
[20210331,27074,1157415,"STATE BANK OF TEXAS",1,1026480,"TX","FDIC","NM",0,13,3308677,3308677,1,1,1,170518,170518,0,977006,0,null,null,null,17.45,34549,78111,835181,0,44723,0,0,0,{"$f":"IFERROR(VLOOKUP(B196, Info!$P$7:$P$1000, 1, FALSE)/VLOOKUP(B196, Info!$P$7:$P$1000, 1, FALSE), 0)","v":0},{"$f":"IFERROR(VLOOKUP(B196, Info!$Q$7:$Q$1000, 1, FALSE)/VLOOKUP(B196, Info!$Q$7:$Q$1000, 1, FALSE), 0)","v":0},{"$f":"IF(OR(P196=1, AH196=1, AI196=1), 1, 0)","v":1}]
[20210331,27267,1169650,"AMERASIA BANK",1,788957,"NY","FDIC","NM",0,2,null,null,0,0,1,96928,96928,102848,770901,588208,16.48,16.48,17.48,12.57,10300,94691,662552,0,1440,0,0,0,{"$f":"IFERROR(VLOOKUP(B197, Info!$P$7:$P$1000, 1, FALSE)/VLOOKUP(B197, Info!$P$7:$P$1000, 1, FALSE), 0)","v":0},{"$f":"IFERROR(VLOOKUP(B197, Info!$Q$7:$Q$1000, 1, FALSE)/VLOOKUP(B197, Info!$Q$7:$Q$1000, 1, FALSE), 0)","v":0},{"$f":"IF(OR(P197=1, AH197=1, AI197=1), 1, 0)","v":1}]
[20210331,28480,596277,"COLUMBIA SAVINGS AND LOAN ASSOCIATION",1,25147,"WI","FDIC","SL",1,9,null,null,0,0,1,1769,1769,1910,24899,15434,11.46,11.46,12.38,7.1,5776,191,16612,0,0,16,0,0,{"$f":"IFERROR(VLOOKUP(B198, Info!$P$7:$P$1000, 1, FALSE)/VLOOKUP(B198, Info!$P$7:$P$1000, 1, FALSE), 0)","v":1},{"$f":"IFERROR(VLOOKUP(B198, Info!$Q$7:$Q$1000, 1, FALSE)/VLOOKUP(B198, Info!$Q$7:$Q$1000, 1, FALSE), 0)","v":0},{"$f":"IF(OR(P198=1, AH198=1, AI198=1), 1, 0)","v":1}]
[20210331,28611,490179,"PULASKI SAVINGS BANK",1,51344,"IL","FDIC","SI",1,9,null,null,0,0,0,3717,3717,3841,49500,21712,17.12,17.12,17.690000000000001,7.51,3742,4063,38971,0,293,0,0,0,{"$f":"IFERROR(VLOOKUP(B199, Info!$P$7:$P$1000, 1, FALSE)/VLOOKUP(B199, Info!$P$7:$P$1000, 1, FALSE), 0)","v":1},{"$f":"IFERROR(VLOOKUP(B199, Info!$Q$7:$Q$1000, 1, FALSE)/VLOOKUP(B199, Info!$Q$7:$Q$1000, 1, FALSE), 0)","v":0},{"$f":"IF(OR(P199=1, AH199=1, AI199=1), 1, 0)","v":1}]
[20210331,28949,715975,"AMORY FEDERAL SAVINGS AND LOAN ASSOCIATION",1,78807,"MS","OCC","SB",1,13,null,null,0,0,0,10514,10514,10960,78561,35682,29.47,29.47,30.72,13.38,14071,6838,45374,3393,0,0,0,0,{"$f":"IFERROR(VLOOKUP(B200, Info!$P$7:$P$1000, 1, FALSE)/VLOOKUP(B200, Info!$P$7:$P$1000, 1, FALSE), 0)","v":1},{"$f":"IFERROR(VLOOKUP(B200, Info!$Q$7:$Q$1000, 1, FALSE)/VLOOKUP(B200, Info!$Q$7:$Q$1000, 1, FALSE), 0)","v":0},{"$f":"IF(OR(P200=1, AH200=1, AI200=1), 1, 0)","v":1}]
[20210331,29399,250476,"GN BANK",1,100686,"IL","OCC","SB",0,9,null,null,0,0,1,9840,9840,10504,100039,57687,17.059999999999999,17.059999999999999,18.21,9.84,992,32989,50664,8010,5320,0,0,0,{"$f":"IFERROR(VLOOKUP(B201, Info!$P$7:$P$1000, 1, FALSE)/VLOOKUP(B201, Info!$P$7:$P$1000, 1, FALSE), 0)","v":1},{"$f":"IFERROR(VLOOKUP(B201, Info!$Q$7:$Q$1000, 1, FALSE)/VLOOKUP(B201, Info!$Q$7:$Q$1000, 1, FALSE), 0)","v":0},{"$f":"IF(OR(P201=1, AH201=1, AI201=1), 1, 0)","v":1}]
[20210331,29804,420578,"ST LANDRY HOMESTEAD FEDERAL SAVINGS BANK",1,236705,"LA","OCC","SB",1,13,null,null,0,0,0,50647,50647,52203,229837,123044,41.16,41.16,42.43,22.04,5790,31281,145948,17517,26493,0,0,0,{"$f":"IFERROR(VLOOKUP(B202, Info!$P$7:$P$1000, 1, FALSE)/VLOOKUP(B202, Info!$P$7:$P$1000, 1, FALSE), 0)","v":1},{"$f":"IFERROR(VLOOKUP(B202, Info!$Q$7:$Q$1000, 1, FALSE)/VLOOKUP(B202, Info!$Q$7:$Q$1000, 1, FALSE), 0)","v":0},{"$f":"IF(OR(P202=1, AH202=1, AI202=1), 1, 0)","v":1}]
[20210331,30306,26176,"BROADWAY FEDERAL BANK, F.S.B.",1,476391,"CA","OCC","SB",0,14,3260841,null,0,0,1,42580,42580,45769,479088,255037,16.7,16.7,17.95,8.89,869,87287,365735,0,10023,0,0,3,{"$f":"IFERROR(VLOOKUP(B203, Info!$P$7:$P$1000, 1, FALSE)/VLOOKUP(B203, Info!$P$7:$P$1000, 1, FALSE), 0)","v":1},{"$f":"IFERROR(VLOOKUP(B203, Info!$Q$7:$Q$1000, 1, FALSE)/VLOOKUP(B203, Info!$Q$7:$Q$1000, 1, FALSE), 0)","v":0},{"$f":"IF(OR(P203=1, AH203=1, AI203=1), 1, 0)","v":1}]
[20210331,30387,510871,"FIRSTBANK PUERTO RICO",1,19408437,"PR","FDIC","NM",0,2,2744894,2744894,0,0,1,2271359,1963359,2421640,18922445,11962211,16.41,18.989999999999998,20.239999999999998,12,113661,1403772,11547042,180811,5406790,5445,0,109428,{"$f":"IFERROR(VLOOKUP(B204, Info!$P$7:$P$1000, 1, FALSE)/VLOOKUP(B204, Info!$P$7:$P$1000, 1, FALSE), 0)","v":0},{"$f":"IFERROR(VLOOKUP(B204, Info!$Q$7:$Q$1000, 1, FALSE)/VLOOKUP(B204, Info!$Q$7:$Q$1000, 1, FALSE), 0)","v":0},{"$f":"IF(OR(P204=1, AH204=1, AI204=1), 1, 0)","v":1}]
[20210331,30394,268677,"CARVER FEDERAL SAVINGS BANK",1,683627,"NY","OCC","SB",0,2,2531245,null,0,0,1,66644,66644,71989,666068,462620,14.41,14.41,15.56,10.01,3281,72305,483548,7807,86507,0,0,147,{"$f":"IFERROR(VLOOKUP(B205, Info!$P$7:$P$1000, 1, FALSE)/VLOOKUP(B205, Info!$P$7:$P$1000, 1, FALSE), 0)","v":1},{"$f":"IFERROR(VLOOKUP(B205, Info!$Q$7:$Q$1000, 1, FALSE)/VLOOKUP(B205, Info!$Q$7:$Q$1000, 1, FALSE), 0)","v":0},{"$f":"IF(OR(P205=1, AH205=1, AI205=1), 1, 0)","v":1}]
[20210331,30692,364270,"BANKPACIFIC, LTD",1,191594,"GU","FDIC","SL",0,14,3842948,null,0,0,1,17899,17899,18563,190083,101310,17.670000000000002,17.670000000000002,18.32,9.42,3931,60837,115006,52,0,0,0,1009,{"$f":"IFERROR(VLOOKUP(B206, Info!$P$7:$P$1000, 1, FALSE)/VLOOKUP(B206, Info!$P$7:$P$1000, 1, FALSE), 0)","v":0},{"$f":"IFERROR(VLOOKUP(B206, Info!$Q$7:$Q$1000, 1, FALSE)/VLOOKUP(B206, Info!$Q$7:$Q$1000, 1, FALSE), 0)","v":0},{"$f":"IF(OR(P206=1, AH206=1, AI206=1), 1, 0)","v":1}]
[20210331,30722,208570,"UNIVERSAL BANK",1,397237,"CA","OCC","SB",0,14,2967835,null,1,0,1,61251,61251,0,412210,0,null,null,null,14.86,3521,65562,302369,4551,1696,0,0,0,{"$f":"IFERROR(VLOOKUP(B207, Info!$P$7:$P$1000, 1, FALSE)/VLOOKUP(B207, Info!$P$7:$P$1000, 1, FALSE), 0)","v":0},{"$f":"IFERROR(VLOOKUP(B207, Info!$Q$7:$Q$1000, 1, FALSE)/VLOOKUP(B207, Info!$Q$7:$Q$1000, 1, FALSE), 0)","v":0},{"$f":"IF(OR(P207=1, AH207=1, AI207=1), 1, 0)","v":1}]
[20210331,30812,90177,"FIRST FEDERAL SAVINGS AND LOAN ASSOCIATION",1,323287,"MS","OCC","SB",1,13,null,null,0,0,0,29986,29986,31057,328739,152681,19.64,19.64,20.34,9.1199999999999992,9374,11831,254978,14335,15564,50,0,0,{"$f":"IFERROR(VLOOKUP(B208, Info!$P$7:$P$1000, 1, FALSE)/VLOOKUP(B208, Info!$P$7:$P$1000, 1, FALSE), 0)","v":1},{"$f":"IFERROR(VLOOKUP(B208, Info!$Q$7:$Q$1000, 1, FALSE)/VLOOKUP(B208, Info!$Q$7:$Q$1000, 1, FALSE), 0)","v":0},{"$f":"IF(OR(P208=1, AH208=1, AI208=1), 1, 0)","v":1}]
[20210331,31100,763677,"SECURITY FEDERAL BANK",1,1178801,"SC","FDIC","NM",0,5,1253773,1253773,0,0,0,113186,113186,120921,1155455,614639,18.420000000000002,18.420000000000002,19.670000000000002,9.8000000000000007,11199,8006,520735,17286,568788,0,0,1200,{"$f":"IFERROR(VLOOKUP(B209, Info!$P$7:$P$1000, 1, FALSE)/VLOOKUP(B209, Info!$P$7:$P$1000, 1, FALSE), 0)","v":1},{"$f":"IFERROR(VLOOKUP(B209, Info!$Q$7:$Q$1000, 1, FALSE)/VLOOKUP(B209, Info!$Q$7:$Q$1000, 1, FALSE), 0)","v":0},{"$f":"IF(OR(P209=1, AH209=1, AI209=1), 1, 0)","v":1}]
[20210331,31158,954671,"FIRST SOUTHERN BANK",1,240720,"MS","FDIC","NM",0,13,3394643,3394643,1,1,0,23784,23784,0,232870,0,null,null,null,10.210000000000001,6109,39500,135084,0,44036,0,0,0,{"$f":"IFERROR(VLOOKUP(B210, Info!$P$7:$P$1000, 1, FALSE)/VLOOKUP(B210, Info!$P$7:$P$1000, 1, FALSE), 0)","v":1},{"$f":"IFERROR(VLOOKUP(B210, Info!$Q$7:$Q$1000, 1, FALSE)/VLOOKUP(B210, Info!$Q$7:$Q$1000, 1, FALSE), 0)","v":0},{"$f":"IF(OR(P210=1, AH210=1, AI210=1), 1, 0)","v":1}]
[20210331,31189,897170,"PONCE BANK",1,1420297,"NY","OCC","SB",0,2,5115468,null,0,0,1,144836,144836,157326,1343204,995958,14.54,14.54,15.8,10.78,14607,77188,1245925,1732,30928,0,0,0,{"$f":"IFERROR(VLOOKUP(B211, Info!$P$7:$P$1000, 1, FALSE)/VLOOKUP(B211, Info!$P$7:$P$1000, 1, FALSE), 0)","v":1},{"$f":"IFERROR(VLOOKUP(B211, Info!$Q$7:$Q$1000, 1, FALSE)/VLOOKUP(B211, Info!$Q$7:$Q$1000, 1, FALSE), 0)","v":0},{"$f":"IF(OR(P211=1, AH211=1, AI211=1), 1, 0)","v":1}]
[20210331,31272,361279,"COMMUNITY BANK",1,188913,"TN","FED","SM",0,13,2613141,2613141,0,0,0,17666,17666,19426,181096,140474,12.58,12.58,13.83,9.76,2898,91,152184,0,9486,0,0,0,{"$f":"IFERROR(VLOOKUP(B212, Info!$P$7:$P$1000, 1, FALSE)/VLOOKUP(B212, Info!$P$7:$P$1000, 1, FALSE), 0)","v":1},{"$f":"IFERROR(VLOOKUP(B212, Info!$Q$7:$Q$1000, 1, FALSE)/VLOOKUP(B212, Info!$Q$7:$Q$1000, 1, FALSE), 0)","v":0},{"$f":"IF(OR(P212=1, AH212=1, AI212=1), 1, 0)","v":1}]
[20210331,31469,245276,"ORIENTAL BANK",1,10000022,"PR","FDIC","NM",0,2,2490575,2490575,0,0,1,879176,879176,963619,9817995,6729236,13.07,13.07,14.32,8.9499999999999993,57517,2180141,6634054,126767,471009,1050,0,175419,{"$f":"IFERROR(VLOOKUP(B213, Info!$P$7:$P$1000, 1, FALSE)/VLOOKUP(B213, Info!$P$7:$P$1000, 1, FALSE), 0)","v":0},{"$f":"IFERROR(VLOOKUP(B213, Info!$Q$7:$Q$1000, 1, FALSE)/VLOOKUP(B213, Info!$Q$7:$Q$1000, 1, FALSE), 0)","v":0},{"$f":"IF(OR(P213=1, AH213=1, AI213=1), 1, 0)","v":1}]
[20210331,31628,197478,"EAST WEST BANK",1,56858871,"CA","FED","SM",0,14,2734233,2734233,0,0,1,4822691,4822691,5293367,55288124,39562525,12.19,12.19,13.38,8.7200000000000006,586705,4773591,38978591,0,7789213,26693,0,476698,{"$f":"IFERROR(VLOOKUP(B214, Info!$P$7:$P$1000, 1, FALSE)/VLOOKUP(B214, Info!$P$7:$P$1000, 1, FALSE), 0)","v":0},{"$f":"IFERROR(VLOOKUP(B214, Info!$Q$7:$Q$1000, 1, FALSE)/VLOOKUP(B214, Info!$Q$7:$Q$1000, 1, FALSE), 0)","v":0},{"$f":"IF(OR(P214=1, AH214=1, AI214=1), 1, 0)","v":1}]
[20210331,31823,221775,"INTERAMERICAN BANK, A FSB",1,251498,"FL","OCC","SB",0,5,null,null,0,0,1,29074,29074,31001,239672,151384,19.21,19.21,20.48,12.13,1238,80227,168577,8,0,0,0,0,{"$f":"IFERROR(VLOOKUP(B215, Info!$P$7:$P$1000, 1, FALSE)/VLOOKUP(B215, Info!$P$7:$P$1000, 1, FALSE), 0)","v":0},{"$f":"IFERROR(VLOOKUP(B215, Info!$Q$7:$Q$1000, 1, FALSE)/VLOOKUP(B215, Info!$Q$7:$Q$1000, 1, FALSE), 0)","v":0},{"$f":"IF(OR(P215=1, AH215=1, AI215=1), 1, 0)","v":1}]
[20210331,32257,762773,"ABACUS FEDERAL SAVINGS BANK",1,358779,"NY","OCC","SB",0,2,null,null,0,0,1,42676,42676,44951,347857,174264,24.49,24.49,25.79,12.27,3442,78040,268089,0,0,0,0,2504,{"$f":"IFERROR(VLOOKUP(B216, Info!$P$7:$P$1000, 1, FALSE)/VLOOKUP(B216, Info!$P$7:$P$1000, 1, FALSE), 0)","v":0},{"$f":"IFERROR(VLOOKUP(B216, Info!$Q$7:$Q$1000, 1, FALSE)/VLOOKUP(B216, Info!$Q$7:$Q$1000, 1, FALSE), 0)","v":0},{"$f":"IF(OR(P216=1, AH216=1, AI216=1), 1, 0)","v":1}]
[20210331,32277,206772,"EASTERN INTERNATIONAL BANK",1,142181,"CA","FDIC","NM",0,14,5230905,5230905,1,0,1,20566,20566,0,141916,0,null,null,null,14.49,1192,24953,98249,0,17326,0,0,0,{"$f":"IFERROR(VLOOKUP(B217, Info!$P$7:$P$1000, 1, FALSE)/VLOOKUP(B217, Info!$P$7:$P$1000, 1, FALSE), 0)","v":0},{"$f":"IFERROR(VLOOKUP(B217, Info!$Q$7:$Q$1000, 1, FALSE)/VLOOKUP(B217, Info!$Q$7:$Q$1000, 1, FALSE), 0)","v":0},{"$f":"IF(OR(P217=1, AH217=1, AI217=1), 1, 0)","v":1}]
[20210331,32459,251978,"HOMELAND FEDERAL SAVINGS BANK",1,406485,"LA","OCC","SB",0,13,3816547,null,1,1,0,36437,36437,0,391553,0,null,null,null,9.31,9131,39798,332646,2276,2406,0,0,0,{"$f":"IFERROR(VLOOKUP(B218, Info!$P$7:$P$1000, 1, FALSE)/VLOOKUP(B218, Info!$P$7:$P$1000, 1, FALSE), 0)","v":1},{"$f":"IFERROR(VLOOKUP(B218, Info!$Q$7:$Q$1000, 1, FALSE)/VLOOKUP(B218, Info!$Q$7:$Q$1000, 1, FALSE), 0)","v":0},{"$f":"IF(OR(P218=1, AH218=1, AI218=1), 1, 0)","v":1}]
[20210331,33013,1462986,"ASIAN PACIFIC NATIONAL BANK",1,55844,"CA","OCC","N",0,14,null,null,1,1,1,10062,10062,0,56368,0,null,null,null,17.850000000000001,519,25075,24206,0,3458,0,0,0,{"$f":"IFERROR(VLOOKUP(B219, Info!$P$7:$P$1000, 1, FALSE)/VLOOKUP(B219, Info!$P$7:$P$1000, 1, FALSE), 0)","v":0},{"$f":"IFERROR(VLOOKUP(B219, Info!$Q$7:$Q$1000, 1, FALSE)/VLOOKUP(B219, Info!$Q$7:$Q$1000, 1, FALSE), 0)","v":0},{"$f":"IF(OR(P219=1, AH219=1, AI219=1), 1, 0)","v":1}]
[20210331,33103,1493319,"GATEWAY BANK, F.S.B.",1,184210,"CA","OCC","SB",0,14,null,null,0,0,1,14693,11006,15783,174508,87012,12.65,16.89,18.14,8.42,1128,18135,139082,0,17875,0,0,469,{"$f":"IFERROR(VLOOKUP(B220, Info!$P$7:$P$1000, 1, FALSE)/VLOOKUP(B220, Info!$P$7:$P$1000, 1, FALSE), 0)","v":0},{"$f":"IFERROR(VLOOKUP(B220, Info!$Q$7:$Q$1000, 1, FALSE)/VLOOKUP(B220, Info!$Q$7:$Q$1000, 1, FALSE), 0)","v":0},{"$f":"IF(OR(P220=1, AH220=1, AI220=1), 1, 0)","v":1}]
[20210331,33188,1494914,"SHINHAN BANK AMERICA",1,1886328,"NY","FDIC","NM",0,2,3107964,1242825,0,0,1,211053,211053,222185,1758623,1339023,15.76,15.76,16.59,12,3858,238529,1571302,2016,52043,0,0,643,{"$f":"IFERROR(VLOOKUP(B221, Info!$P$7:$P$1000, 1, FALSE)/VLOOKUP(B221, Info!$P$7:$P$1000, 1, FALSE), 0)","v":0},{"$f":"IFERROR(VLOOKUP(B221, Info!$Q$7:$Q$1000, 1, FALSE)/VLOOKUP(B221, Info!$Q$7:$Q$1000, 1, FALSE), 0)","v":0},{"$f":"IF(OR(P221=1, AH221=1, AI221=1), 1, 0)","v":1}]
[20210331,33316,1852569,"ANZ GUAM, INC.",1,421080,"GU","FDIC","NM",0,14,1241985,2608110,1,0,1,46469,46469,0,395846,0,null,null,null,11.74,9532,333642,73458,0,0,0,0,1013,{"$f":"IFERROR(VLOOKUP(B222, Info!$P$7:$P$1000, 1, FALSE)/VLOOKUP(B222, Info!$P$7:$P$1000, 1, FALSE), 0)","v":0},{"$f":"IFERROR(VLOOKUP(B222, Info!$Q$7:$Q$1000, 1, FALSE)/VLOOKUP(B222, Info!$Q$7:$Q$1000, 1, FALSE), 0)","v":0},{"$f":"IF(OR(P222=1, AH222=1, AI222=1), 1, 0)","v":1}]
[20210331,33539,1918344,"PREFERRED BANK",1,5450151,"CA","FDIC","NM",0,14,null,null,0,0,1,532457,532457,691511,5188369,4693462,11.34,11.34,14.73,10.26,9078,913364,4179369,6039,228635,0,0,716,{"$f":"IFERROR(VLOOKUP(B223, Info!$P$7:$P$1000, 1, FALSE)/VLOOKUP(B223, Info!$P$7:$P$1000, 1, FALSE), 0)","v":0},{"$f":"IFERROR(VLOOKUP(B223, Info!$Q$7:$Q$1000, 1, FALSE)/VLOOKUP(B223, Info!$Q$7:$Q$1000, 1, FALSE), 0)","v":0},{"$f":"IF(OR(P223=1, AH223=1, AI223=1), 1, 0)","v":1}]
[20210331,33568,1945247,"UNITED BANK OF PHILADELPHIA",1,60861,"PA","FDIC","NM",0,2,2259268,2259268,0,0,1,5208,5208,5499,57137,23261,22.39,22.39,23.64,9.11,1662,6045,38881,0,1436,138,0,164,{"$f":"IFERROR(VLOOKUP(B224, Info!$P$7:$P$1000, 1, FALSE)/VLOOKUP(B224, Info!$P$7:$P$1000, 1, FALSE), 0)","v":1},{"$f":"IFERROR(VLOOKUP(B224, Info!$Q$7:$Q$1000, 1, FALSE)/VLOOKUP(B224, Info!$Q$7:$Q$1000, 1, FALSE), 0)","v":0},{"$f":"IF(OR(P224=1, AH224=1, AI224=1), 1, 0)","v":1}]
[20210331,33708,2006024,"INTERNATIONAL BANK OF CHICAGO",1,837618,"IL","FDIC","NM",0,9,2339759,2339759,0,1,1,85255,85255,91527,817374,497006,17.149999999999999,17.149999999999999,18.420000000000002,10.43,3148,47028,615009,0,164988,2611,0,27,{"$f":"IFERROR(VLOOKUP(B225, Info!$P$7:$P$1000, 1, FALSE)/VLOOKUP(B225, Info!$P$7:$P$1000, 1, FALSE), 0)","v":1},{"$f":"IFERROR(VLOOKUP(B225, Info!$Q$7:$Q$1000, 1, FALSE)/VLOOKUP(B225, Info!$Q$7:$Q$1000, 1, FALSE), 0)","v":0},{"$f":"IF(OR(P225=1, AH225=1, AI225=1), 1, 0)","v":1}]
[20210331,34010,2297998,"EVERTRUST BANK",1,1025466,"CA","FDIC","NM",0,14,3462494,3462485,1,0,1,164861,164861,0,986429,0,null,null,null,16.71,1557,150889,708191,0,88385,0,0,38133,{"$f":"IFERROR(VLOOKUP(B226, Info!$P$7:$P$1000, 1, FALSE)/VLOOKUP(B226, Info!$P$7:$P$1000, 1, FALSE), 0)","v":0},{"$f":"IFERROR(VLOOKUP(B226, Info!$Q$7:$Q$1000, 1, FALSE)/VLOOKUP(B226, Info!$Q$7:$Q$1000, 1, FALSE), 0)","v":0},{"$f":"IF(OR(P226=1, AH226=1, AI226=1), 1, 0)","v":1}]
[20210331,34052,2329200,"BAY BANK",1,158806,"WI","FDIC","NM",0,9,2340867,2340867,0,0,1,16524,16524,17537,141441,80508,20.52,20.52,21.78,11.68,11262,13324,79937,0,28904,0,0,580,{"$f":"IFERROR(VLOOKUP(B227, Info!$P$7:$P$1000, 1, FALSE)/VLOOKUP(B227, Info!$P$7:$P$1000, 1, FALSE), 0)","v":1},{"$f":"IFERROR(VLOOKUP(B227, Info!$Q$7:$Q$1000, 1, FALSE)/VLOOKUP(B227, Info!$Q$7:$Q$1000, 1, FALSE), 0)","v":0},{"$f":"IF(OR(P227=1, AH227=1, AI227=1), 1, 0)","v":1}]
[20210331,34108,2343167,"PAN AMERICAN BANK & TRUST",1,381703,"IL","FDIC","NM",0,9,3618545,3618545,0,1,0,33590,33590,37072,370885,278125,12.08,12.08,13.33,9.06,15807,17926,288931,4750,40533,0,0,0,{"$f":"IFERROR(VLOOKUP(B228, Info!$P$7:$P$1000, 1, FALSE)/VLOOKUP(B228, Info!$P$7:$P$1000, 1, FALSE), 0)","v":1},{"$f":"IFERROR(VLOOKUP(B228, Info!$Q$7:$Q$1000, 1, FALSE)/VLOOKUP(B228, Info!$Q$7:$Q$1000, 1, FALSE), 0)","v":0},{"$f":"IF(OR(P228=1, AH228=1, AI228=1), 1, 0)","v":1}]
[20210331,34110,2354387,"QUANTUM NATIONAL BANK",1,638118,"GA","OCC","N",0,5,2354369,2354369,1,1,1,62341,62341,0,611821,0,null,null,null,10.19,2911,74200,542179,0,6856,0,0,889,{"$f":"IFERROR(VLOOKUP(B229, Info!$P$7:$P$1000, 1, FALSE)/VLOOKUP(B229, Info!$P$7:$P$1000, 1, FALSE), 0)","v":0},{"$f":"IFERROR(VLOOKUP(B229, Info!$Q$7:$Q$1000, 1, FALSE)/VLOOKUP(B229, Info!$Q$7:$Q$1000, 1, FALSE), 0)","v":0},{"$f":"IF(OR(P229=1, AH229=1, AI229=1), 1, 0)","v":1}]
[20210331,34146,2396592,"PEOPLE'S BANK OF SENECA",1,304037,"MO","FDIC","NM",0,11,4096645,4096645,1,0,1,25153,25153,0,291477,0,null,null,null,8.6300000000000008,5850,37415,232685,0,16097,0,0,505,{"$f":"IFERROR(VLOOKUP(B230, Info!$P$7:$P$1000, 1, FALSE)/VLOOKUP(B230, Info!$P$7:$P$1000, 1, FALSE), 0)","v":0},{"$f":"IFERROR(VLOOKUP(B230, Info!$Q$7:$Q$1000, 1, FALSE)/VLOOKUP(B230, Info!$Q$7:$Q$1000, 1, FALSE), 0)","v":0},{"$f":"IF(OR(P230=1, AH230=1, AI230=1), 1, 0)","v":1}]
[20210331,34210,2483438,"COMMUNITY BANK OF THE BAY",1,762107,"CA","FDIC","NM",0,14,5537958,5537958,0,0,0,62930,62930,68725,684997,464006,13.56,13.56,14.81,9.19,6391,164236,541589,0,24634,0,0,228,{"$f":"IFERROR(VLOOKUP(B231, Info!$P$7:$P$1000, 1, FALSE)/VLOOKUP(B231, Info!$P$7:$P$1000, 1, FALSE), 0)","v":1},{"$f":"IFERROR(VLOOKUP(B231, Info!$Q$7:$Q$1000, 1, FALSE)/VLOOKUP(B231, Info!$Q$7:$Q$1000, 1, FALSE), 0)","v":0},{"$f":"IF(OR(P231=1, AH231=1, AI231=1), 1, 0)","v":1}]
[20210331,34217,2385514,"THE FIRST, A NATIONAL BANKING ASSOCIATION",1,5436548,"MS","OCC","N",0,13,2385493,2385493,0,0,0,532578,532578,564241,5115296,3222272,16.53,16.53,17.510000000000002,10.41,117269,695738,3070212,0,1135188,0,0,186648,{"$f":"IFERROR(VLOOKUP(B232, Info!$P$7:$P$1000, 1, FALSE)/VLOOKUP(B232, Info!$P$7:$P$1000, 1, FALSE), 0)","v":1},{"$f":"IFERROR(VLOOKUP(B232, Info!$Q$7:$Q$1000, 1, FALSE)/VLOOKUP(B232, Info!$Q$7:$Q$1000, 1, FALSE), 0)","v":0},{"$f":"IF(OR(P232=1, AH232=1, AI232=1), 1, 0)","v":1}]
[20210331,34319,2625724,"SOUTHWESTERN NATIONAL BANK",1,775423,"TX","OCC","N",0,13,3234682,3234682,0,0,1,92554,92554,100131,758408,598433,15.47,15.47,16.73,12.2,20916,103101,629060,0,13908,0,0,0,{"$f":"IFERROR(VLOOKUP(B233, Info!$P$7:$P$1000, 1, FALSE)/VLOOKUP(B233, Info!$P$7:$P$1000, 1, FALSE), 0)","v":0},{"$f":"IFERROR(VLOOKUP(B233, Info!$Q$7:$Q$1000, 1, FALSE)/VLOOKUP(B233, Info!$Q$7:$Q$1000, 1, FALSE), 0)","v":0},{"$f":"IF(OR(P233=1, AH233=1, AI233=1), 1, 0)","v":1}]
[20210331,34334,2533043,"AMERICAN METRO BANK",1,85722,"IL","FDIC","NM",0,9,3272367,3272367,0,0,1,9624,9624,10217,85589,47214,20.38,20.38,21.64,11.24,1174,22984,60033,0,0,0,0,0,{"$f":"IFERROR(VLOOKUP(B234, Info!$P$7:$P$1000, 1, FALSE)/VLOOKUP(B234, Info!$P$7:$P$1000, 1, FALSE), 0)","v":0},{"$f":"IFERROR(VLOOKUP(B234, Info!$Q$7:$Q$1000, 1, FALSE)/VLOOKUP(B234, Info!$Q$7:$Q$1000, 1, FALSE), 0)","v":0},{"$f":"IF(OR(P234=1, AH234=1, AI234=1), 1, 0)","v":1}]
[20210331,34352,2697963,"CITY FIRST BANK OF D.C., NATIONAL ASSOCIATION",1,470754,"DC","OCC","N",0,14,2697954,2697945,1,0,0,33543,33543,0,443747,0,null,null,null,7.56,1122,59615,228160,0,150052,0,0,0,{"$f":"IFERROR(VLOOKUP(B235, Info!$P$7:$P$1000, 1, FALSE)/VLOOKUP(B235, Info!$P$7:$P$1000, 1, FALSE), 0)","v":1},{"$f":"IFERROR(VLOOKUP(B235, Info!$Q$7:$Q$1000, 1, FALSE)/VLOOKUP(B235, Info!$Q$7:$Q$1000, 1, FALSE), 0)","v":0},{"$f":"IF(OR(P235=1, AH235=1, AI235=1), 1, 0)","v":1}]
[20210331,34496,2332910,"FIRST COMMERCIAL BANK (USA)",1,780572,"CA","FDIC","NM",0,14,3086210,1142587,0,0,1,141880,141880,149147,727901,581096,24.42,24.42,25.67,19.489999999999998,1612,60006,669837,5484,23469,0,0,0,{"$f":"IFERROR(VLOOKUP(B236, Info!$P$7:$P$1000, 1, FALSE)/VLOOKUP(B236, Info!$P$7:$P$1000, 1, FALSE), 0)","v":0},{"$f":"IFERROR(VLOOKUP(B236, Info!$Q$7:$Q$1000, 1, FALSE)/VLOOKUP(B236, Info!$Q$7:$Q$1000, 1, FALSE), 0)","v":0},{"$f":"IF(OR(P236=1, AH236=1, AI236=1), 1, 0)","v":1}]
[20210331,34548,2333140,"NEIGHBORHOOD NATIONAL BANK",1,129348,"CA","OCC","N",0,14,2333131,2333131,0,0,0,10850,10850,11389,102909,42360,25.61,25.61,26.89,10.54,987,2026,78194,0,92,0,0,91,{"$f":"IFERROR(VLOOKUP(B237, Info!$P$7:$P$1000, 1, FALSE)/VLOOKUP(B237, Info!$P$7:$P$1000, 1, FALSE), 0)","v":1},{"$f":"IFERROR(VLOOKUP(B237, Info!$Q$7:$Q$1000, 1, FALSE)/VLOOKUP(B237, Info!$Q$7:$Q$1000, 1, FALSE), 0)","v":0},{"$f":"IF(OR(P237=1, AH237=1, AI237=1), 1, 0)","v":1}]
[20210331,34643,2791085,"SUNSTATE BANK",1,521811,"FL","FDIC","NM",0,5,null,null,0,0,1,46470,46470,49424,510077,368441,12.61,12.61,13.41,9.11,14781,102791,248843,0,60541,0,0,8581,{"$f":"IFERROR(VLOOKUP(B238, Info!$P$7:$P$1000, 1, FALSE)/VLOOKUP(B238, Info!$P$7:$P$1000, 1, FALSE), 0)","v":0},{"$f":"IFERROR(VLOOKUP(B238, Info!$Q$7:$Q$1000, 1, FALSE)/VLOOKUP(B238, Info!$Q$7:$Q$1000, 1, FALSE), 0)","v":0},{"$f":"IF(OR(P238=1, AH238=1, AI238=1), 1, 0)","v":1}]
[20210331,34656,2694681,"AMERICAN FIRST NATIONAL BANK",1,2101037,"TX","OCC","N",0,13,3472176,3472176,0,0,1,231963,231963,253317,2072332,1985870,11.68,11.68,12.76,11.19,45780,91282,1873011,0,59101,0,0,0,{"$f":"IFERROR(VLOOKUP(B239, Info!$P$7:$P$1000, 1, FALSE)/VLOOKUP(B239, Info!$P$7:$P$1000, 1, FALSE), 0)","v":0},{"$f":"IFERROR(VLOOKUP(B239, Info!$Q$7:$Q$1000, 1, FALSE)/VLOOKUP(B239, Info!$Q$7:$Q$1000, 1, FALSE), 0)","v":0},{"$f":"IF(OR(P239=1, AH239=1, AI239=1), 1, 0)","v":1}]
[20210331,34759,2785477,"ASIAN BANK",1,279693,"PA","FED","SM",0,2,2785459,2785459,0,0,1,30847,30847,33454,267358,208205,14.82,14.82,16.07,11.54,2329,4126,230711,0,8919,0,0,0,{"$f":"IFERROR(VLOOKUP(B240, Info!$P$7:$P$1000, 1, FALSE)/VLOOKUP(B240, Info!$P$7:$P$1000, 1, FALSE), 0)","v":1},{"$f":"IFERROR(VLOOKUP(B240, Info!$Q$7:$Q$1000, 1, FALSE)/VLOOKUP(B240, Info!$Q$7:$Q$1000, 1, FALSE), 0)","v":0},{"$f":"IF(OR(P240=1, AH240=1, AI240=1), 1, 0)","v":1}]
[20210331,34784,2756730,"COMMERCIAL CAPITAL BANK",1,234599,"LA","FDIC","NM",0,13,2757111,2757111,1,1,0,26318,26318,0,232055,0,null,null,null,11.34,4303,66495,143807,10087,0,0,0,0,{"$f":"IFERROR(VLOOKUP(B241, Info!$P$7:$P$1000, 1, FALSE)/VLOOKUP(B241, Info!$P$7:$P$1000, 1, FALSE), 0)","v":1},{"$f":"IFERROR(VLOOKUP(B241, Info!$Q$7:$Q$1000, 1, FALSE)/VLOOKUP(B241, Info!$Q$7:$Q$1000, 1, FALSE), 0)","v":0},{"$f":"IF(OR(P241=1, AH241=1, AI241=1), 1, 0)","v":1}]
[20210331,34938,2746245,"COMMERCE BANK",1,151315,"MS","FED","SM",0,13,3135435,3135435,1,1,0,15915,15915,0,148864,0,null,null,null,10.69,2379,15876,87983,0,33138,0,0,0,{"$f":"IFERROR(VLOOKUP(B242, Info!$P$7:$P$1000, 1, FALSE)/VLOOKUP(B242, Info!$P$7:$P$1000, 1, FALSE), 0)","v":1},{"$f":"IFERROR(VLOOKUP(B242, Info!$Q$7:$Q$1000, 1, FALSE)/VLOOKUP(B242, Info!$Q$7:$Q$1000, 1, FALSE), 0)","v":0},{"$f":"IF(OR(P242=1, AH242=1, AI242=1), 1, 0)","v":1}]
[20210331,34967,2736291,"POPULAR BANK",1,10557535,"NY","FED","SM",0,2,1129382,2138466,0,0,1,1246084,1246084,1312050,9683763,7415105,16.8,16.8,17.690000000000001,12.87,86508,699136,7800913,0,1201493,8824,0,354453,{"$f":"IFERROR(VLOOKUP(B243, Info!$P$7:$P$1000, 1, FALSE)/VLOOKUP(B243, Info!$P$7:$P$1000, 1, FALSE), 0)","v":0},{"$f":"IFERROR(VLOOKUP(B243, Info!$Q$7:$Q$1000, 1, FALSE)/VLOOKUP(B243, Info!$Q$7:$Q$1000, 1, FALSE), 0)","v":0},{"$f":"IF(OR(P243=1, AH243=1, AI243=1), 1, 0)","v":1}]
[20210331,34968,940311,"BANCO POPULAR DE PUERTO RICO",1,55853000,"PR","FED","SM",0,2,1129382,1129382,0,0,1,4170000,4170000,4456000,55338000,22732100,18.34,18.34,19.600000000000001,7.54,446000,10869000,15969000,293000,21495000,2000,12000,445000,{"$f":"IFERROR(VLOOKUP(B244, Info!$P$7:$P$1000, 1, FALSE)/VLOOKUP(B244, Info!$P$7:$P$1000, 1, FALSE), 0)","v":0},{"$f":"IFERROR(VLOOKUP(B244, Info!$Q$7:$Q$1000, 1, FALSE)/VLOOKUP(B244, Info!$Q$7:$Q$1000, 1, FALSE), 0)","v":0},{"$f":"IF(OR(P244=1, AH244=1, AI244=1), 1, 0)","v":1}]
[20210331,34998,2877840,"FIRST IC BANK",1,812031,"GA","FDIC","NM",0,5,3589980,3589980,0,0,1,87199,87199,94871,797219,611993,14.25,14.25,15.5,10.94,9936,160753,591725,0,41771,0,0,1964,{"$f":"IFERROR(VLOOKUP(B245, Info!$P$7:$P$1000, 1, FALSE)/VLOOKUP(B245, Info!$P$7:$P$1000, 1, FALSE), 0)","v":0},{"$f":"IFERROR(VLOOKUP(B245, Info!$Q$7:$Q$1000, 1, FALSE)/VLOOKUP(B245, Info!$Q$7:$Q$1000, 1, FALSE), 0)","v":0},{"$f":"IF(OR(P245=1, AH245=1, AI245=1), 1, 0)","v":1}]
[20210331,35151,2833882,"NEW MILLENNIUM BANK",1,462359,"NJ","FDIC","NM",0,2,5011832,5011832,0,0,1,43155,43155,47054,462853,307730,14.02,14.02,15.29,9.32,1813,72485,376662,1332,623,0,0,3106,{"$f":"IFERROR(VLOOKUP(B246, Info!$P$7:$P$1000, 1, FALSE)/VLOOKUP(B246, Info!$P$7:$P$1000, 1, FALSE), 0)","v":0},{"$f":"IFERROR(VLOOKUP(B246, Info!$Q$7:$Q$1000, 1, FALSE)/VLOOKUP(B246, Info!$Q$7:$Q$1000, 1, FALSE), 0)","v":0},{"$f":"IF(OR(P246=1, AH246=1, AI246=1), 1, 0)","v":1}]
[20210331,35241,2794732,"OPTUS BANK",1,196323,"SC","FDIC","NM",0,5,3334489,3334489,1,0,1,15480,15480,0,146435,0,null,null,null,10.57,256,34149,91604,0,11097,0,0,0,{"$f":"IFERROR(VLOOKUP(B247, Info!$P$7:$P$1000, 1, FALSE)/VLOOKUP(B247, Info!$P$7:$P$1000, 1, FALSE), 0)","v":1},{"$f":"IFERROR(VLOOKUP(B247, Info!$Q$7:$Q$1000, 1, FALSE)/VLOOKUP(B247, Info!$Q$7:$Q$1000, 1, FALSE), 0)","v":0},{"$f":"IF(OR(P247=1, AH247=1, AI247=1), 1, 0)","v":1}]
[20210331,35314,2877484,"ALAMERICA BANK",1,16153,"AL","FDIC","NM",0,5,3047583,3047583,0,1,1,2123,2123,2253,16247,10340,20.53,20.53,21.79,13.07,823,4449,7972,0,2067,0,0,0,{"$f":"IFERROR(VLOOKUP(B248, Info!$P$7:$P$1000, 1, FALSE)/VLOOKUP(B248, Info!$P$7:$P$1000, 1, FALSE), 0)","v":0},{"$f":"IFERROR(VLOOKUP(B248, Info!$Q$7:$Q$1000, 1, FALSE)/VLOOKUP(B248, Info!$Q$7:$Q$1000, 1, FALSE), 0)","v":0},{"$f":"IF(OR(P248=1, AH248=1, AI248=1), 1, 0)","v":1}]
[20210331,35439,2877831,"BANK OF BROOKHAVEN",1,220297,"MS","FDIC","NM",0,13,4361923,4361923,0,0,0,20274,20274,21398,211968,124335,16.309999999999999,16.309999999999999,17.21,9.56,5238,23018,110482,0,73591,0,0,0,{"$f":"IFERROR(VLOOKUP(B249, Info!$P$7:$P$1000, 1, FALSE)/VLOOKUP(B249, Info!$P$7:$P$1000, 1, FALSE), 0)","v":1},{"$f":"IFERROR(VLOOKUP(B249, Info!$Q$7:$Q$1000, 1, FALSE)/VLOOKUP(B249, Info!$Q$7:$Q$1000, 1, FALSE), 0)","v":0},{"$f":"IF(OR(P249=1, AH249=1, AI249=1), 1, 0)","v":1}]
[20210331,57034,2938769,"OXFORD UNIVERSITY BANK",1,197645,"MS","FDIC","NM",0,13,3260551,3260551,1,0,0,19076,19076,0,189485,0,null,null,null,10.07,4088,13311,140855,763,31303,0,0,0,{"$f":"IFERROR(VLOOKUP(B250, Info!$P$7:$P$1000, 1, FALSE)/VLOOKUP(B250, Info!$P$7:$P$1000, 1, FALSE), 0)","v":1},{"$f":"IFERROR(VLOOKUP(B250, Info!$Q$7:$Q$1000, 1, FALSE)/VLOOKUP(B250, Info!$Q$7:$Q$1000, 1, FALSE), 0)","v":0},{"$f":"IF(OR(P250=1, AH250=1, AI250=1), 1, 0)","v":1}]
[20210331,57083,3049729,"PLUS INTERNATIONAL BANK",1,94294,"FL","FDIC","NM",0,5,null,null,0,0,1,13812,13812,14309,98299,39412,35.049999999999997,35.049999999999997,36.31,14.05,24120,1327,67441,650,542,0,0,0,{"$f":"IFERROR(VLOOKUP(B251, Info!$P$7:$P$1000, 1, FALSE)/VLOOKUP(B251, Info!$P$7:$P$1000, 1, FALSE), 0)","v":0},{"$f":"IFERROR(VLOOKUP(B251, Info!$Q$7:$Q$1000, 1, FALSE)/VLOOKUP(B251, Info!$Q$7:$Q$1000, 1, FALSE), 0)","v":0},{"$f":"IF(OR(P251=1, AH251=1, AI251=1), 1, 0)","v":1}]
[20210331,57101,3039636,"MISSION VALLEY BANK",1,440910,"CA","FDIC","NM",0,14,3364600,3364600,0,0,0,45647,45647,49391,438491,298661,15.28,15.28,16.54,10.41,19433,31322,325328,0,46800,791,0,994,{"$f":"IFERROR(VLOOKUP(B252, Info!$P$7:$P$1000, 1, FALSE)/VLOOKUP(B252, Info!$P$7:$P$1000, 1, FALSE), 0)","v":1},{"$f":"IFERROR(VLOOKUP(B252, Info!$Q$7:$Q$1000, 1, FALSE)/VLOOKUP(B252, Info!$Q$7:$Q$1000, 1, FALSE), 0)","v":0},{"$f":"IF(OR(P252=1, AH252=1, AI252=1), 1, 0)","v":1}]
[20210331,57119,2942823,"UNITED BANK OF EL PASO DEL NORTE",1,296817,"TX","FED","SM",0,13,4877031,4877031,0,0,1,33110,33110,35857,287444,218447,15.16,15.16,16.41,11.52,34632,224,211841,0,29468,0,0,0,{"$f":"IFERROR(VLOOKUP(B253, Info!$P$7:$P$1000, 1, FALSE)/VLOOKUP(B253, Info!$P$7:$P$1000, 1, FALSE), 0)","v":0},{"$f":"IFERROR(VLOOKUP(B253, Info!$Q$7:$Q$1000, 1, FALSE)/VLOOKUP(B253, Info!$Q$7:$Q$1000, 1, FALSE), 0)","v":0},{"$f":"IF(OR(P253=1, AH253=1, AI253=1), 1, 0)","v":1}]
[20210331,57134,3109146,"LEADER BANK, NATIONAL ASSOCIATION",1,2419615,"MA","OCC","N",0,2,3439236,3439236,0,0,1,326998,326998,345564,2342740,1524591,21.45,21.45,22.67,13.96,34298,242285,1876643,4615,187648,0,0,21187,{"$f":"IFERROR(VLOOKUP(B254, Info!$P$7:$P$1000, 1, FALSE)/VLOOKUP(B254, Info!$P$7:$P$1000, 1, FALSE), 0)","v":0},{"$f":"IFERROR(VLOOKUP(B254, Info!$Q$7:$Q$1000, 1, FALSE)/VLOOKUP(B254, Info!$Q$7:$Q$1000, 1, FALSE), 0)","v":0},{"$f":"IF(OR(P254=1, AH254=1, AI254=1), 1, 0)","v":1}]
[20210331,57369,3146150,"U. S. CENTURY BANK",1,1633359,"FL","FDIC","NM",0,5,null,null,0,0,1,131108,99031,144200,1529563,1045282,9.4700000000000006,12.54,13.8,8.57,8500,97440,1103981,0,341344,0,0,0,{"$f":"IFERROR(VLOOKUP(B255, Info!$P$7:$P$1000, 1, FALSE)/VLOOKUP(B255, Info!$P$7:$P$1000, 1, FALSE), 0)","v":0},{"$f":"IFERROR(VLOOKUP(B255, Info!$Q$7:$Q$1000, 1, FALSE)/VLOOKUP(B255, Info!$Q$7:$Q$1000, 1, FALSE), 0)","v":0},{"$f":"IF(OR(P255=1, AH255=1, AI255=1), 1, 0)","v":1}]
[20210331,57417,3189063,"COMMERCIAL BANK OF CALIFORNIA",1,1645773,"CA","FDIC","NM",0,14,2925406,2925406,1,0,1,135165,135165,0,1525453,0,null,null,null,8.86,25062,312358,1164684,0,102458,0,0,4570,{"$f":"IFERROR(VLOOKUP(B256, Info!$P$7:$P$1000, 1, FALSE)/VLOOKUP(B256, Info!$P$7:$P$1000, 1, FALSE), 0)","v":0},{"$f":"IFERROR(VLOOKUP(B256, Info!$Q$7:$Q$1000, 1, FALSE)/VLOOKUP(B256, Info!$Q$7:$Q$1000, 1, FALSE), 0)","v":0},{"$f":"IF(OR(P256=1, AH256=1, AI256=1), 1, 0)","v":1}]
[20210331,57444,3216316,"AMERICAN CONTINENTAL BANK",1,328579,"CA","FDIC","NM",0,14,4842721,4842721,1,0,1,37310,37310,0,317053,0,null,null,null,11.77,950,84460,227944,0,3438,0,0,901,{"$f":"IFERROR(VLOOKUP(B257, Info!$P$7:$P$1000, 1, FALSE)/VLOOKUP(B257, Info!$P$7:$P$1000, 1, FALSE), 0)","v":0},{"$f":"IFERROR(VLOOKUP(B257, Info!$Q$7:$Q$1000, 1, FALSE)/VLOOKUP(B257, Info!$Q$7:$Q$1000, 1, FALSE), 0)","v":0},{"$f":"IF(OR(P257=1, AH257=1, AI257=1), 1, 0)","v":1}]
[20210331,57463,3212402,"PACIFIC CITY BANK",1,2050610,"CA","FDIC","NM",0,14,3595084,3595084,0,0,1,234302,234302,253137,1984246,1499937,15.62,15.62,16.88,11.81,16514,195266,1689485,0,127114,0,0,6253,{"$f":"IFERROR(VLOOKUP(B258, Info!$P$7:$P$1000, 1, FALSE)/VLOOKUP(B258, Info!$P$7:$P$1000, 1, FALSE), 0)","v":0},{"$f":"IFERROR(VLOOKUP(B258, Info!$Q$7:$Q$1000, 1, FALSE)/VLOOKUP(B258, Info!$Q$7:$Q$1000, 1, FALSE), 0)","v":0},{"$f":"IF(OR(P258=1, AH258=1, AI258=1), 1, 0)","v":1}]
[20210331,57483,3174920,"CITIZENS BANK & TRUST",1,790373,"AL","FDIC","NM",0,5,3439179,3439179,0,0,0,64167,64167,69631,754449,436540,14.7,14.7,15.95,8.51,9542,141294,400825,0,188604,0,0,0,{"$f":"IFERROR(VLOOKUP(B259, Info!$P$7:$P$1000, 1, FALSE)/VLOOKUP(B259, Info!$P$7:$P$1000, 1, FALSE), 0)","v":1},{"$f":"IFERROR(VLOOKUP(B259, Info!$Q$7:$Q$1000, 1, FALSE)/VLOOKUP(B259, Info!$Q$7:$Q$1000, 1, FALSE), 0)","v":0},{"$f":"IF(OR(P259=1, AH259=1, AI259=1), 1, 0)","v":1}]
[20210331,57741,3224302,"FIRST SOUTHWEST BANK",1,411524,"CO","FDIC","NM",0,13,3228681,3228681,0,0,0,30690,30690,33306,393225,208809,14.7,14.7,15.95,7.8,5979,46530,246684,42322,57764,0,0,4271,{"$f":"IFERROR(VLOOKUP(B260, Info!$P$7:$P$1000, 1, FALSE)/VLOOKUP(B260, Info!$P$7:$P$1000, 1, FALSE), 0)","v":1},{"$f":"IFERROR(VLOOKUP(B260, Info!$Q$7:$Q$1000, 1, FALSE)/VLOOKUP(B260, Info!$Q$7:$Q$1000, 1, FALSE), 0)","v":0},{"$f":"IF(OR(P260=1, AH260=1, AI260=1), 1, 0)","v":1}]
[20210331,57807,3340725,"QUONTIC BANK",1,1424657,"NY","OCC","SB",0,2,4098537,null,1,0,0,60359,60359,0,569575,0,null,null,null,10.6,2931,116093,1269666,0,5106,0,0,2677,{"$f":"IFERROR(VLOOKUP(B261, Info!$P$7:$P$1000, 1, FALSE)/VLOOKUP(B261, Info!$P$7:$P$1000, 1, FALSE), 0)","v":1},{"$f":"IFERROR(VLOOKUP(B261, Info!$Q$7:$Q$1000, 1, FALSE)/VLOOKUP(B261, Info!$Q$7:$Q$1000, 1, FALSE), 0)","v":0},{"$f":"IF(OR(P261=1, AH261=1, AI261=1), 1, 0)","v":1}]
[20210331,57815,3402913,"BANESCO USA",1,1971103,"FL","FDIC","NM",0,5,null,null,0,0,1,169633,169633,201767,1979258,1387703,12.22,12.22,14.54,8.57,6960,45146,1218896,402,408684,0,0,104,{"$f":"IFERROR(VLOOKUP(B262, Info!$P$7:$P$1000, 1, FALSE)/VLOOKUP(B262, Info!$P$7:$P$1000, 1, FALSE), 0)","v":0},{"$f":"IFERROR(VLOOKUP(B262, Info!$Q$7:$Q$1000, 1, FALSE)/VLOOKUP(B262, Info!$Q$7:$Q$1000, 1, FALSE), 0)","v":0},{"$f":"IF(OR(P262=1, AH262=1, AI262=1), 1, 0)","v":1}]
[20210331,57873,3337097,"COMMONWEALTH BUSINESS BANK",1,1436721,"CA","FED","SM",0,14,5124938,5124938,0,0,1,161844,161844,175375,1362641,1080322,14.98,14.98,16.23,11.88,9215,129506,1189695,4618,78791,0,0,10000,{"$f":"IFERROR(VLOOKUP(B263, Info!$P$7:$P$1000, 1, FALSE)/VLOOKUP(B263, Info!$P$7:$P$1000, 1, FALSE), 0)","v":0},{"$f":"IFERROR(VLOOKUP(B263, Info!$Q$7:$Q$1000, 1, FALSE)/VLOOKUP(B263, Info!$Q$7:$Q$1000, 1, FALSE), 0)","v":0},{"$f":"IF(OR(P263=1, AH263=1, AI263=1), 1, 0)","v":1}]
[20210331,57901,3296859,"ONE WORLD BANK",1,139172,"TX","FDIC","NM",0,13,3311109,3311109,1,0,1,15769,15769,0,130128,0,null,null,null,12.12,2586,14471,118265,0,2026,0,0,690,{"$f":"IFERROR(VLOOKUP(B264, Info!$P$7:$P$1000, 1, FALSE)/VLOOKUP(B264, Info!$P$7:$P$1000, 1, FALSE), 0)","v":0},{"$f":"IFERROR(VLOOKUP(B264, Info!$Q$7:$Q$1000, 1, FALSE)/VLOOKUP(B264, Info!$Q$7:$Q$1000, 1, FALSE), 0)","v":0},{"$f":"IF(OR(P264=1, AH264=1, AI264=1), 1, 0)","v":1}]
[20210331,57915,3286999,"BANK OF GRAND LAKE",1,215895,"OK","FDIC","NM",0,13,4446521,4446521,0,1,1,15054,15054,15930,209697,123930,12.15,12.15,12.85,7.18,3137,26676,133460,38141,0,0,0,0,{"$f":"IFERROR(VLOOKUP(B265, Info!$P$7:$P$1000, 1, FALSE)/VLOOKUP(B265, Info!$P$7:$P$1000, 1, FALSE), 0)","v":0},{"$f":"IFERROR(VLOOKUP(B265, Info!$Q$7:$Q$1000, 1, FALSE)/VLOOKUP(B265, Info!$Q$7:$Q$1000, 1, FALSE), 0)","v":0},{"$f":"IF(OR(P265=1, AH265=1, AI265=1), 1, 0)","v":1}]
[20210331,57944,3357219,"OPEN BANK",1,1455259,"CA","FDIC","NM",0,14,4980409,4980409,0,0,1,143390,143390,156696,1409401,1061055,13.51,13.51,14.77,10.17,20386,107138,1184447,0,102414,3720,0,7492,{"$f":"IFERROR(VLOOKUP(B266, Info!$P$7:$P$1000, 1, FALSE)/VLOOKUP(B266, Info!$P$7:$P$1000, 1, FALSE), 0)","v":0},{"$f":"IFERROR(VLOOKUP(B266, Info!$Q$7:$Q$1000, 1, FALSE)/VLOOKUP(B266, Info!$Q$7:$Q$1000, 1, FALSE), 0)","v":0},{"$f":"IF(OR(P266=1, AH266=1, AI266=1), 1, 0)","v":1}]
[20210331,57966,3374878,"FIRST CHOICE BANK",1,2505732,"CA","FED","SM",0,14,5163003,5163003,1,0,1,209314,209314,0,2147592,0,null,null,null,9.75,29452,279994,2041269,1348,37376,2774,0,80971,{"$f":"IFERROR(VLOOKUP(B267, Info!$P$7:$P$1000, 1, FALSE)/VLOOKUP(B267, Info!$P$7:$P$1000, 1, FALSE), 0)","v":1},{"$f":"IFERROR(VLOOKUP(B267, Info!$Q$7:$Q$1000, 1, FALSE)/VLOOKUP(B267, Info!$Q$7:$Q$1000, 1, FALSE), 0)","v":0},{"$f":"IF(OR(P267=1, AH267=1, AI267=1), 1, 0)","v":1}]
[20210331,57974,3394380,"CALIFORNIA INTERNATIONAL BANK, N.A.",1,80839,"CA","OCC","N",0,14,null,null,0,0,1,11482,11482,11802,86220,23469,48.92,48.92,50.29,13.32,938,27179,52924,0,360,0,0,96,{"$f":"IFERROR(VLOOKUP(B268, Info!$P$7:$P$1000, 1, FALSE)/VLOOKUP(B268, Info!$P$7:$P$1000, 1, FALSE), 0)","v":0},{"$f":"IFERROR(VLOOKUP(B268, Info!$Q$7:$Q$1000, 1, FALSE)/VLOOKUP(B268, Info!$Q$7:$Q$1000, 1, FALSE), 0)","v":0},{"$f":"IF(OR(P268=1, AH268=1, AI268=1), 1, 0)","v":1}]
[20210331,58037,3390337,"CALIFORNIA BUSINESS BANK",1,99518,"CA","FDIC","NM",0,14,null,null,0,0,1,11605,11605,12429,91055,64909,17.88,17.88,19.149999999999999,12.75,5639,22624,64515,0,0,0,0,9,{"$f":"IFERROR(VLOOKUP(B269, Info!$P$7:$P$1000, 1, FALSE)/VLOOKUP(B269, Info!$P$7:$P$1000, 1, FALSE), 0)","v":0},{"$f":"IFERROR(VLOOKUP(B269, Info!$Q$7:$Q$1000, 1, FALSE)/VLOOKUP(B269, Info!$Q$7:$Q$1000, 1, FALSE), 0)","v":0},{"$f":"IF(OR(P269=1, AH269=1, AI269=1), 1, 0)","v":1}]
[20210331,58060,3386264,"FIRST GENERAL BANK",1,1124350,"CA","FDIC","NM",0,14,null,null,1,0,1,162510,162510,0,1106870,0,null,null,null,14.68,4455,18270,1036212,3515,4433,0,0,1426,{"$f":"IFERROR(VLOOKUP(B270, Info!$P$7:$P$1000, 1, FALSE)/VLOOKUP(B270, Info!$P$7:$P$1000, 1, FALSE), 0)","v":1},{"$f":"IFERROR(VLOOKUP(B270, Info!$Q$7:$Q$1000, 1, FALSE)/VLOOKUP(B270, Info!$Q$7:$Q$1000, 1, FALSE), 0)","v":0},{"$f":"IF(OR(P270=1, AH270=1, AI270=1), 1, 0)","v":1}]
[20210331,58181,3437456,"METRO CITY BANK",1,2158968,"GA","FDIC","NM",0,5,4750086,4750086,0,0,1,229219,229219,240954,2001305,1290251,17.77,17.77,18.670000000000002,11.45,22916,146859,1871813,0,18739,0,0,22257,{"$f":"IFERROR(VLOOKUP(B271, Info!$P$7:$P$1000, 1, FALSE)/VLOOKUP(B271, Info!$P$7:$P$1000, 1, FALSE), 0)","v":0},{"$f":"IFERROR(VLOOKUP(B271, Info!$Q$7:$Q$1000, 1, FALSE)/VLOOKUP(B271, Info!$Q$7:$Q$1000, 1, FALSE), 0)","v":0},{"$f":"IF(OR(P271=1, AH271=1, AI271=1), 1, 0)","v":1}]
[20210331,58196,3388165,"NOAH BANK",1,360379,"PA","FDIC","NM",0,2,null,null,0,0,1,26182,26182,39828,340710,286354,9.14,9.14,13.91,7.68,2341,54101,291484,3000,280,2946,0,2851,{"$f":"IFERROR(VLOOKUP(B272, Info!$P$7:$P$1000, 1, FALSE)/VLOOKUP(B272, Info!$P$7:$P$1000, 1, FALSE), 0)","v":1},{"$f":"IFERROR(VLOOKUP(B272, Info!$Q$7:$Q$1000, 1, FALSE)/VLOOKUP(B272, Info!$Q$7:$Q$1000, 1, FALSE), 0)","v":0},{"$f":"IF(OR(P272=1, AH272=1, AI272=1), 1, 0)","v":1}]
[20210331,58203,3472859,"NEWBANK",1,471722,"NY","FDIC","NM",0,2,null,null,1,0,1,52302,52302,0,462320,0,null,null,null,11.31,3167,128760,330458,0,34,0,0,415,{"$f":"IFERROR(VLOOKUP(B273, Info!$P$7:$P$1000, 1, FALSE)/VLOOKUP(B273, Info!$P$7:$P$1000, 1, FALSE), 0)","v":0},{"$f":"IFERROR(VLOOKUP(B273, Info!$Q$7:$Q$1000, 1, FALSE)/VLOOKUP(B273, Info!$Q$7:$Q$1000, 1, FALSE), 0)","v":0},{"$f":"IF(OR(P273=1, AH273=1, AI273=1), 1, 0)","v":1}]
[20210331,58231,3447772,"OHANA PACIFIC BANK",1,206548,"HI","FDIC","NM",0,14,null,null,0,0,1,21603,21603,23270,196303,133134,16.23,16.23,17.48,11,1284,43032,154979,4912,817,0,0,0,{"$f":"IFERROR(VLOOKUP(B274, Info!$P$7:$P$1000, 1, FALSE)/VLOOKUP(B274, Info!$P$7:$P$1000, 1, FALSE), 0)","v":0},{"$f":"IFERROR(VLOOKUP(B274, Info!$Q$7:$Q$1000, 1, FALSE)/VLOOKUP(B274, Info!$Q$7:$Q$1000, 1, FALSE), 0)","v":0},{"$f":"IF(OR(P274=1, AH274=1, AI274=1), 1, 0)","v":1}]
[20210331,58234,3546862,"PACIFIC ALLIANCE BANK",1,358733,"CA","FDIC","NM",0,14,null,null,1,0,1,41125,41125,0,359656,0,null,null,null,11.43,1467,35313,271267,0,28488,0,0,246,{"$f":"IFERROR(VLOOKUP(B275, Info!$P$7:$P$1000, 1, FALSE)/VLOOKUP(B275, Info!$P$7:$P$1000, 1, FALSE), 0)","v":0},{"$f":"IFERROR(VLOOKUP(B275, Info!$Q$7:$Q$1000, 1, FALSE)/VLOOKUP(B275, Info!$Q$7:$Q$1000, 1, FALSE), 0)","v":0},{"$f":"IF(OR(P275=1, AH275=1, AI275=1), 1, 0)","v":1}]
[20210331,58255,3437157,"RIVER BANK & TRUST",1,2058693,"AL","FDIC","NM",0,5,4422851,4422851,0,0,0,165504,165504,181052,1902953,1241381,13.33,13.33,14.58,8.6999999999999993,19593,50786,1225660,0,643927,0,0,31583,{"$f":"IFERROR(VLOOKUP(B276, Info!$P$7:$P$1000, 1, FALSE)/VLOOKUP(B276, Info!$P$7:$P$1000, 1, FALSE), 0)","v":1},{"$f":"IFERROR(VLOOKUP(B276, Info!$Q$7:$Q$1000, 1, FALSE)/VLOOKUP(B276, Info!$Q$7:$Q$1000, 1, FALSE), 0)","v":0},{"$f":"IF(OR(P276=1, AH276=1, AI276=1), 1, 0)","v":1}]
[20210331,58263,3561771,"GLOBAL BANK",1,214496,"NY","FDIC","NM",0,2,null,null,1,0,1,26775,26775,0,209272,0,null,null,null,12.79,437,8534,200167,0,1205,0,0,0,{"$f":"IFERROR(VLOOKUP(B277, Info!$P$7:$P$1000, 1, FALSE)/VLOOKUP(B277, Info!$P$7:$P$1000, 1, FALSE), 0)","v":0},{"$f":"IFERROR(VLOOKUP(B277, Info!$Q$7:$Q$1000, 1, FALSE)/VLOOKUP(B277, Info!$Q$7:$Q$1000, 1, FALSE), 0)","v":0},{"$f":"IF(OR(P277=1, AH277=1, AI277=1), 1, 0)","v":1}]
[20210331,58282,3346633,"EAGLE BANK",1,94579,"MT","FDIC","NM",0,14,3346624,3346624,1,0,1,9634,9634,0,95618,0,null,null,null,10.08,3955,3010,61958,67,23312,0,0,0,{"$f":"IFERROR(VLOOKUP(B278, Info!$P$7:$P$1000, 1, FALSE)/VLOOKUP(B278, Info!$P$7:$P$1000, 1, FALSE), 0)","v":0},{"$f":"IFERROR(VLOOKUP(B278, Info!$Q$7:$Q$1000, 1, FALSE)/VLOOKUP(B278, Info!$Q$7:$Q$1000, 1, FALSE), 0)","v":0},{"$f":"IF(OR(P278=1, AH278=1, AI278=1), 1, 0)","v":1}]
[20210331,58310,3470154,"US METRO BANK",1,859736,"CA","FDIC","NM",0,14,5397219,5397219,0,0,1,88956,88956,95970,806613,557714,15.95,15.95,17.21,11.03,11316,227423,613579,0,0,0,0,2497,{"$f":"IFERROR(VLOOKUP(B279, Info!$P$7:$P$1000, 1, FALSE)/VLOOKUP(B279, Info!$P$7:$P$1000, 1, FALSE), 0)","v":0},{"$f":"IFERROR(VLOOKUP(B279, Info!$Q$7:$Q$1000, 1, FALSE)/VLOOKUP(B279, Info!$Q$7:$Q$1000, 1, FALSE), 0)","v":0},{"$f":"IF(OR(P279=1, AH279=1, AI279=1), 1, 0)","v":1}]
[20210331,58348,3547896,"MILLENNIUM BANK",1,244454,"IL","FDIC","NM",0,9,3547887,3547887,0,1,1,26253,26253,28017,232301,140578,18.68,18.68,19.93,11.3,9756,66225,165629,0,0,0,0,2720,{"$f":"IFERROR(VLOOKUP(B280, Info!$P$7:$P$1000, 1, FALSE)/VLOOKUP(B280, Info!$P$7:$P$1000, 1, FALSE), 0)","v":0},{"$f":"IFERROR(VLOOKUP(B280, Info!$Q$7:$Q$1000, 1, FALSE)/VLOOKUP(B280, Info!$Q$7:$Q$1000, 1, FALSE), 0)","v":0},{"$f":"IF(OR(P280=1, AH280=1, AI280=1), 1, 0)","v":1}]
[20210331,58357,3531176,"SOUTHERN INDEPENDENT BANK",1,301394,"AL","FDIC","NM",0,5,4297527,4297527,1,0,0,30454,30454,0,298814,0,null,null,null,10.19,8660,11527,138524,2515,99945,0,0,0,{"$f":"IFERROR(VLOOKUP(B281, Info!$P$7:$P$1000, 1, FALSE)/VLOOKUP(B281, Info!$P$7:$P$1000, 1, FALSE), 0)","v":1},{"$f":"IFERROR(VLOOKUP(B281, Info!$Q$7:$Q$1000, 1, FALSE)/VLOOKUP(B281, Info!$Q$7:$Q$1000, 1, FALSE), 0)","v":0},{"$f":"IF(OR(P281=1, AH281=1, AI281=1), 1, 0)","v":1}]
[20210331,58377,3468450,"CENTRAL BANK",1,308975,"FL","FDIC","NM",0,5,3468478,3468478,0,0,1,20613,20613,22951,233302,186406,11.06,11.06,12.31,8.84,2441,22437,246616,0,6585,0,0,608,{"$f":"IFERROR(VLOOKUP(B282, Info!$P$7:$P$1000, 1, FALSE)/VLOOKUP(B282, Info!$P$7:$P$1000, 1, FALSE), 0)","v":0},{"$f":"IFERROR(VLOOKUP(B282, Info!$Q$7:$Q$1000, 1, FALSE)/VLOOKUP(B282, Info!$Q$7:$Q$1000, 1, FALSE), 0)","v":0},{"$f":"IF(OR(P282=1, AH282=1, AI282=1), 1, 0)","v":1}]
[20210331,58401,3690635,"MEGA BANK",1,416896,"CA","FDIC","NM",0,14,null,null,1,0,1,45052,45052,0,412302,0,null,null,null,10.93,3549,45250,350316,0,0,0,0,450,{"$f":"IFERROR(VLOOKUP(B283, Info!$P$7:$P$1000, 1, FALSE)/VLOOKUP(B283, Info!$P$7:$P$1000, 1, FALSE), 0)","v":0},{"$f":"IFERROR(VLOOKUP(B283, Info!$Q$7:$Q$1000, 1, FALSE)/VLOOKUP(B283, Info!$Q$7:$Q$1000, 1, FALSE), 0)","v":0},{"$f":"IF(OR(P283=1, AH283=1, AI283=1), 1, 0)","v":1}]
[20210331,58407,3487947,"UNIBANK",1,411846,"WA","FED","SM",0,14,4125086,4125086,0,0,1,57891,57891,61466,390733,285029,20.309999999999999,20.309999999999999,21.56,14.82,1891,21442,311945,0,55843,0,0,1967,{"$f":"IFERROR(VLOOKUP(B284, Info!$P$7:$P$1000, 1, FALSE)/VLOOKUP(B284, Info!$P$7:$P$1000, 1, FALSE), 0)","v":0},{"$f":"IFERROR(VLOOKUP(B284, Info!$Q$7:$Q$1000, 1, FALSE)/VLOOKUP(B284, Info!$Q$7:$Q$1000, 1, FALSE), 0)","v":0},{"$f":"IF(OR(P284=1, AH284=1, AI284=1), 1, 0)","v":1}]
[20210331,58413,3482045,"EMBASSY NATIONAL BANK",1,114045,"GA","OCC","N",0,5,3482054,3482054,0,0,1,18393,18393,19386,115891,78908,23.31,23.31,24.57,15.87,630,4944,80461,0,0,0,0,915,{"$f":"IFERROR(VLOOKUP(B285, Info!$P$7:$P$1000, 1, FALSE)/VLOOKUP(B285, Info!$P$7:$P$1000, 1, FALSE), 0)","v":0},{"$f":"IFERROR(VLOOKUP(B285, Info!$Q$7:$Q$1000, 1, FALSE)/VLOOKUP(B285, Info!$Q$7:$Q$1000, 1, FALSE), 0)","v":0},{"$f":"IF(OR(P285=1, AH285=1, AI285=1), 1, 0)","v":1}]
[20210331,58469,3623110,"AMERICAN PLUS BANK, N.A.",1,586061,"CA","OCC","N",0,14,null,null,1,0,1,90353,90353,0,585530,0,null,null,null,15.43,988,13952,501404,1253,15940,0,0,0,{"$f":"IFERROR(VLOOKUP(B286, Info!$P$7:$P$1000, 1, FALSE)/VLOOKUP(B286, Info!$P$7:$P$1000, 1, FALSE), 0)","v":1},{"$f":"IFERROR(VLOOKUP(B286, Info!$Q$7:$Q$1000, 1, FALSE)/VLOOKUP(B286, Info!$Q$7:$Q$1000, 1, FALSE), 0)","v":0},{"$f":"IF(OR(P286=1, AH286=1, AI286=1), 1, 0)","v":1}]
[20210331,58490,3608751,"BENEFICIAL STATE BANK",1,1378518,"CA","FDIC","NM",0,14,3842649,3842630,1,0,0,119666,119666,0,1287571,0,null,null,null,9.2899999999999991,7204,83972,1048714,0,212921,1033,0,0,{"$f":"IFERROR(VLOOKUP(B287, Info!$P$7:$P$1000, 1, FALSE)/VLOOKUP(B287, Info!$P$7:$P$1000, 1, FALSE), 0)","v":1},{"$f":"IFERROR(VLOOKUP(B287, Info!$Q$7:$Q$1000, 1, FALSE)/VLOOKUP(B287, Info!$Q$7:$Q$1000, 1, FALSE), 0)","v":0},{"$f":"IF(OR(P287=1, AH287=1, AI287=1), 1, 0)","v":1}]
[20210331,58586,3626184,"TURTLE MOUNTAIN STATE BANK",1,68112,"ND","FDIC","NM",0,11,null,null,0,1,1,3455,3455,3672,55900,17365,19.899999999999999,19.899999999999999,21.15,6.18,1902,6443,23179,0,4965,0,0,0,{"$f":"IFERROR(VLOOKUP(B288, Info!$P$7:$P$1000, 1, FALSE)/VLOOKUP(B288, Info!$P$7:$P$1000, 1, FALSE), 0)","v":0},{"$f":"IFERROR(VLOOKUP(B288, Info!$Q$7:$Q$1000, 1, FALSE)/VLOOKUP(B288, Info!$Q$7:$Q$1000, 1, FALSE), 0)","v":0},{"$f":"IF(OR(P288=1, AH288=1, AI288=1), 1, 0)","v":1}]
[20210331,58641,3685396,"SAVOY BANK",1,691582,"NY","FDIC","NM",0,2,null,null,0,0,0,48456,48456,52448,431369,314850,15.39,15.39,16.66,11.23,465,80813,600649,0,945,0,0,3356,{"$f":"IFERROR(VLOOKUP(B289, Info!$P$7:$P$1000, 1, FALSE)/VLOOKUP(B289, Info!$P$7:$P$1000, 1, FALSE), 0)","v":1},{"$f":"IFERROR(VLOOKUP(B289, Info!$Q$7:$Q$1000, 1, FALSE)/VLOOKUP(B289, Info!$Q$7:$Q$1000, 1, FALSE), 0)","v":0},{"$f":"IF(OR(P289=1, AH289=1, AI289=1), 1, 0)","v":1}]
[20210331,58657,3832127,"PROMISEONE BANK",1,544796,"GA","FDIC","NM",0,5,4816320,4816320,0,1,1,62229,62229,66430,526616,352694,17.64,17.64,18.84,11.82,16167,36576,388795,0,81553,0,0,7549,{"$f":"IFERROR(VLOOKUP(B290, Info!$P$7:$P$1000, 1, FALSE)/VLOOKUP(B290, Info!$P$7:$P$1000, 1, FALSE), 0)","v":0},{"$f":"IFERROR(VLOOKUP(B290, Info!$Q$7:$Q$1000, 1, FALSE)/VLOOKUP(B290, Info!$Q$7:$Q$1000, 1, FALSE), 0)","v":0},{"$f":"IF(OR(P290=1, AH290=1, AI290=1), 1, 0)","v":1}]
[20210331,58658,3626858,"VCC BANK",1,221787,"VA","FED","SM",0,5,3628535,3628535,1,0,0,24842,24842,0,206768,0,null,null,null,12.01,74,17599,173479,5033,17752,0,0,0,{"$f":"IFERROR(VLOOKUP(B291, Info!$P$7:$P$1000, 1, FALSE)/VLOOKUP(B291, Info!$P$7:$P$1000, 1, FALSE), 0)","v":1},{"$f":"IFERROR(VLOOKUP(B291, Info!$Q$7:$Q$1000, 1, FALSE)/VLOOKUP(B291, Info!$Q$7:$Q$1000, 1, FALSE), 0)","v":0},{"$f":"IF(OR(P291=1, AH291=1, AI291=1), 1, 0)","v":1}]
[20210331,58668,3368925,"SPRING BANK",1,336220,"NY","FDIC","NM",0,2,3368916,3368916,1,0,0,27728,27728,0,254001,0,null,null,null,10.92,1804,36493,263410,0,29854,119,0,109,{"$f":"IFERROR(VLOOKUP(B292, Info!$P$7:$P$1000, 1, FALSE)/VLOOKUP(B292, Info!$P$7:$P$1000, 1, FALSE), 0)","v":1},{"$f":"IFERROR(VLOOKUP(B292, Info!$Q$7:$Q$1000, 1, FALSE)/VLOOKUP(B292, Info!$Q$7:$Q$1000, 1, FALSE), 0)","v":0},{"$f":"IF(OR(P292=1, AH292=1, AI292=1), 1, 0)","v":1}]
[20210331,58687,3645840,"TOUCHMARK NATIONAL BANK",1,419943,"GA","OCC","N",0,5,3645886,3645886,0,0,1,51419,51419,53994,422968,203028,25.33,25.33,26.59,12.16,762,21005,373720,0,15491,0,0,1577,{"$f":"IFERROR(VLOOKUP(B293, Info!$P$7:$P$1000, 1, FALSE)/VLOOKUP(B293, Info!$P$7:$P$1000, 1, FALSE), 0)","v":0},{"$f":"IFERROR(VLOOKUP(B293, Info!$Q$7:$Q$1000, 1, FALSE)/VLOOKUP(B293, Info!$Q$7:$Q$1000, 1, FALSE), 0)","v":0},{"$f":"IF(OR(P293=1, AH293=1, AI293=1), 1, 0)","v":1}]
[20210331,58816,3835454,"ROYAL BUSINESS BANK",1,3663156,"CA","FDIC","NM",0,14,4176855,4176855,0,0,1,448066,448066,479261,3334538,2494716,17.96,17.96,19.21,13.44,32822,330708,2808884,6668,281581,0,0,87402,{"$f":"IFERROR(VLOOKUP(B294, Info!$P$7:$P$1000, 1, FALSE)/VLOOKUP(B294, Info!$P$7:$P$1000, 1, FALSE), 0)","v":1},{"$f":"IFERROR(VLOOKUP(B294, Info!$Q$7:$Q$1000, 1, FALSE)/VLOOKUP(B294, Info!$Q$7:$Q$1000, 1, FALSE), 0)","v":0},{"$f":"IF(OR(P294=1, AH294=1, AI294=1), 1, 0)","v":1}]
[20210331,58952,3843392,"NEW HAVEN BANK",1,166459,"CT","FED","SM",0,2,4151012,4151003,0,0,0,15407,15407,16674,160625,100977,15.26,15.26,16.510000000000002,9.59,539,14728,137582,0,6797,0,0,0,{"$f":"IFERROR(VLOOKUP(B295, Info!$P$7:$P$1000, 1, FALSE)/VLOOKUP(B295, Info!$P$7:$P$1000, 1, FALSE), 0)","v":1},{"$f":"IFERROR(VLOOKUP(B295, Info!$Q$7:$Q$1000, 1, FALSE)/VLOOKUP(B295, Info!$Q$7:$Q$1000, 1, FALSE), 0)","v":0},{"$f":"IF(OR(P295=1, AH295=1, AI295=1), 1, 0)","v":1}]
[20210331,59154,5342974,"PIERMONT BANK",1,253855,"NY","FDIC","NM",0,2,null,null,0,0,1,32783,32783,33949,194827,101194,32.4,32.4,33.549999999999997,16.829999999999998,86,109812,99487,0,43047,0,0,0,{"$f":"IFERROR(VLOOKUP(B296, Info!$P$7:$P$1000, 1, FALSE)/VLOOKUP(B296, Info!$P$7:$P$1000, 1, FALSE), 0)","v":0},{"$f":"IFERROR(VLOOKUP(B296, Info!$Q$7:$Q$1000, 1, FALSE)/VLOOKUP(B296, Info!$Q$7:$Q$1000, 1, FALSE), 0)","v":0},{"$f":"IF(OR(P296=1, AH296=1, AI296=1), 1, 0)","v":1}]
[20210331,59182,5427684,"LOYAL TRUST BANK",1,105068,"GA","FDIC","NM",0,5,null,null,0,0,1,22230,22230,22812,93355,82003,27.11,27.11,27.82,23.81,1572,31670,69721,0,1134,0,0,92,{"$f":"IFERROR(VLOOKUP(B297, Info!$P$7:$P$1000, 1, FALSE)/VLOOKUP(B297, Info!$P$7:$P$1000, 1, FALSE), 0)","v":0},{"$f":"IFERROR(VLOOKUP(B297, Info!$Q$7:$Q$1000, 1, FALSE)/VLOOKUP(B297, Info!$Q$7:$Q$1000, 1, FALSE), 0)","v":0},{"$f":"IF(OR(P297=1, AH297=1, AI297=1), 1, 0)","v":1}]
[]
[]
[]
[]
[]
[]
[]
[]
[]
[]
[]
[]
[]
[]
[]
[]
[]
[]
[]
[]
[]
[]
[]
[]
[]
[]
[]
[]
[]
[]
[]
[]
[]
[]
[]
[]
[]
[]
[]
[]
[]
[]
[]
[]
[]
[]
[]
[]
[]
[]
[]
[]
[]
[]
[]
[]
[]
[]
[]
[]
[]
[]
[]
[]
[]
[]
[]
[]
[]
[]
[]
[]
[]
[]
[]
[]
[]
[]
[]
[]
[]
[]
[]
[]
[]
[]
[]
[]
[]
[]
[]
[]
[]
[]
[]
[]
[]
[]
[]
[]
[]
[]
[]
[]
[]
[]
[]
[]
[]
[]
[]
[]
[]
[]
[]
[]
[]
[]
[]
[]
[]
[]
[]
[]
[]
[]
[]
[]
[]
[]
[]
[]
[]
[]
[]
[]
[]
[]
[]
[]
[]
[]
[]
[]
[]
[]
[]
[]
[]
[]
[]
[]
[]
[]
[]
[]
[]
[]
[]
[]
[]
[]
[]
[]
[]
[]
[]
[]
[]
[]
[]
[]
[]
[]
[]
[]
[]
[]
[]
[]
[]
[]
[]
[]
[]
[]
[]
[]
[]
[]
[]
[]
[]
[]
[]
[]
[]
[]
[]
[]
[]
[]
[]
[]
[]
[]
[]
[]
[]
[]
[]
[]
[]
[]
[]
[]
[]
[]
[]
[]
[]
[]
[]
[]
[]
[]
[]
[]
[]
[]
[]
[]
[]
[]
[]
[]
[]
[]
[]
[]
[]
[]
[]
[]
[]
[]
[]
[]
[]
[]
[]
[]
[]
[]
[]
[]
[]
[]
[]
[]
[]
[]
[]
[]
[]
[]
[]
[]
[]
[]
[]
[]
[]
[]
[]
[]
[]
[]
[]
[]
[]
[]
[]
[]
[]
[]
[]
[]
[]
[]
[]
[]
[]
[]
[]
[]
[]
[]
[]
[]
[]
[]
[]
[]
[]
[]
[]
[]
[]
[]
[]
[]
[]
[]
[]
[]
[]
[]
[]
[]
[]
[]
[]
[]
[]
[]
[]
[]
[]
[]
[]
[]
[]
[]
[]
[]
[]
[]
[]
[]
[]
[]
[]
[]
[]
[]
[]
[]
[]
[]
[]
[]
[]
[]
[]
[]
[]
[]
[]
[]
[]
[]
[]
[]
[]
[]
[]
[]
[]
[]
[]
[]
[]
[]
[]
[]
[]
[]
[]
[]
[]
[]
[]
[]
[]
[]
[]
[]
[]
[]
[]
[]
[]
[]
[]
[]
[]
[]
[]
[]
[]
[]
[]
[]
[]
[]
[]
[]
[]
[]
[]
[]
[]
[]
[]
[]
[]
[]
[]
[]
[]
[]
[]
[]
[]
[]
[]
[]
[]
[]
[]
[]
[]
[]
[]
[]
[]
[]
[]
[]
[]
[]
[]
[]
[]
[]
[]
[]
[]
[]
[]
[]
[]
[]
[]
[]
[]
[]
[]
[]
[]
[]
[]
[]
[]
[]
[]
[]
[]
[]
[]
[]
[]
[]
[]
[]
[]
[]
[]
[]
[]
[]
[]
[]
[]
[]
[]
[]
[]
[]
[]
[]
[]
[]
[]
[]
[]
[]
[]
[]
[]
[]
[]
[]
[]
[]
[]
[]
[]
[]
[]
[]
[]
[]
[]
[]
[]
[]
[]
[]
[]
[]
[]
[]
[]
[]
[]
[]
[]
[]
[]
[]
[]
[]
[]
[]
[]
[]
[]
[]
[]
[]
[]
[]
[]
[]
[]
[]
[]
[]
[]
[]
[]
[]
[]
[]
[]
[]
[]
[]
[]
[]
[]
[]
[]
[]
[]
[]
[]
[]
[]
[]
[]
[]
[]
[]
[]
[]
[]
[]
[]
[]
[]
[]
[]
[]
[]
[]
[]
[]
[]
[]
[]
[]
[]
[]
[]
[]
[]
[]
[]
[]
[]
[]
[]
[]
[]
[]
[]
[]
[]
[]
[]
[]
[]
[]
[]
[]
[]
[]
[]
[]
[]
[]
[]
[]
[]
[]
[]
[]
[]
[]
[]
[]
[]
[]
[]
[]
[]
[]
[]
[]
[]
[]
[]
[]
[]
[]
[]
[]
[]
[]
[]
[]
[]
[]
[]
[]
[]
[]
[]
[]
[]
[]
[]
[]
[]
[]
[]
[]
[]
[]
[]
[]
[]
[]
[]
[]
[]
[]
[]
[]
[]
[]
[]
[]
[]
[]
[]
[]
[]
[]
[]
[]
[]
[]
[]
[]
[]
[]
[]
[]
[]
[]
[]
[]
[]
[]
[]
[]
[]
[]
[]
[]
[]
[]
[]
[]
[]
[]
[]
[]
[]
[]
[]
[]
[]
[]
[]
[]
[]
[]
[]
[]
[]
[]
[]
[]
[]
[]
[]
[]
[]
[]
[]
[]
[]
[]
[]
[]
[]
[]
[]
[]
[]
[]
[]
[]
[]
[]
[]
[]
[]
[]
[]
[]
[]
[]
[]
[]
[]
[]
[]
[]
[]
[]
[]
[]
[]
[]
[]
[]
[]
[]
[]
[]
[]
[]
[]
[]
[]
[]
[]
[]
[]
[]
[]
[]
[]
[]
[]
[]
[]
[]
[]
[]
[]
[]
[]
[]
[]
[]
[]
[]
[]
[]
[]
[]
[]
[]
[]
[]
[]
[]
[]
[]
[]
[]
[]
[]
[]
[]
[]
[]
[]
[]
[]
[]
[]
[]
[]
[]
[]
[]
[]
[]
[]
[]
[]
[]
[]
[]
[]
[]
[]
[]
[]
[]
[]
[]
[]
[]
[]
[]
[]
[]
[]
[]
[]
[]
[]
[]
[]
[]
[]
[]
[]
[]
[]
[]
[]
[]
[]
[]
[]
[]
[]
[]
[]
[]
[]
[]
[]
[]
[]
[]
[]
[]
[]
[]
[]
[]
[]
[]
[]
[]
[]
[]
[]
[]
[]
[]
[]
[]
[]
[]
[]
[]
[]
[]
[]
[]
[]
[]
[]
[]
[]
[]
[]
[]
[]
[]
[]
[]
[]
[]
[]
[]
[]
[]
[]
[]
[]
[]
[]
[]
[]
[]
[]
[]
[]
[]
[]
[]
[]
[]
[]
[]
[]
[]
[]
[]
[]
[]
[]
[]
[]
[]
[]
[]
[]
[]
[]
[]
[]
[]
[]
[]
[]
[]
[]
[]
[]
[]
[]
[]
[]
[]
[]
[]
[]
[]
[]
[]
[]
[]
[]
[]
[]
[]
[]
[]
[]
[]
[]
[]
[]
[]
[]
[]
[]
[]
[]
[]
[]
[]
[]
[]
[]
[]
[]
[]
[]
[]
[]
[]
[]
[]
[]
[]
[]
[]
[]
[]
[]
[]
[]
[]
[]
[]
[]
[]
[]
[]
[]
[]
[]
[]
[]
[]
[]
[]
[]
[]
[]
[]
[]
[]
[]
[]
[]
[]
[]
[]
[]
[]
[]
[]
[]
[]
[]
[]
[]
[]
[]
[]
[]
[]
[]
[]
[]
[]
[]
[]
[]
[]
[]
[]
[]
[]
[]
[]
[]
[]
[]
[]
[]
[]
[]
[]
[]
[]
[]
[]
[]
[]
[]
[]
[]
[]
[]
[]
[]
[]
[]
[]
[]
[]
[]
[]
[]
[]
[]
[]
[]
[]
[]
[]
[]
[]
[]
[]
[]
[]
[]
[]
[]
[]
[]
[]
[]
[]
[]
[]
[]
[]
[]
[]
[]
[]
[]
[]
[]
[]
[]
[]
[]
[]
[]
[]
[]
[]
[]
[]
[]
[]
[]
[]
[]
[]
[]
[]
[]
[]
[]
[]
[]
[]
[]
[]
[]
[]
[]
[]
[]
[]
[]
[]
[]
[]
[]
[]
[]
[]
[]
[]
[]
[]
[]
[]
[]
[]
[]
[]
[]
[]
[]
[]
[]
[]
[]
[]
[]
[]
[]
[]
[]
[]
[]
[]
[]
[]
[]
[]
[]
[]
[]
[]
[]
[]
[]
[]
[]
[]
[]
[]
[]
[]
[]
[]
[]
[]
[]
[]
[]
[]
[]
[]
[]
[]
[]
[]
[]
[]
[]
[]
[]
[]
[]
[]
[]
[]
[]
[]
[]
[]
[]
[]
[]
[]
[]
[]
[]
[]
[]
[]
[]
[]
[]
[]
[]
[]
[]
[]
[]
[]
[]
[]
[]
[]
[]
[]
[]
[]
[]
[]
[]
[]
[]
[]
[]
[]
[]
[]
[]
[]
[]
[]
[]
[]
[]
[]
[]
[]
[]
[]
[]
[]
[]
[]
[]
[]
[]
[]
[]
[]
[]
[]
[]
[]
[]
[]
[]
[]
[]
[]
[]
[]
[]
[]
[]
[]
[]
[]
[]
[]
[]
[]
[]
[]
[]
[]
[]
[]
[]
[]
[]
[]
[]
[]
[]
[]
[]
[]
[]
[]
[]
[]
[]
[]
[]
[]
[]
[]
[]
[]
[]
[]
[]
[]
[]
[]
[]
[]
[]
[]
[]
[]
[]
[]
[]
[]
[]
[]
[]
[]
[]
[]
[]
[]
[]
[]
[]
[]
[]
[]
[]
[]
[]
[]
[]
[]
[]
[]
[]
[]
[]
[]
[]
[]
[]
[]
[]
[]
[]
[]
[]
[]
[]
[]
[]
[]
[]
[]
[]
[]
[]
[]
[]
[]
[]
[]
[]
[]
[]
[]
[]
[]
[]
[]
[]
[]
[]
[]
[]
[]
[]
[]
[]
[]
[]
[]
[]
[]
[]
[]
[]
[]
[]
[]
[]
[]
[]
[]
[]
[]
[]
[]
[]
[]
[]
[]
[]
[]
[]
[]
[]
[]
[]
[]
[]
[]
[]
[]
[]
[]
[]
[]
[]
[]
[]
[]
[]
[]
[]
[]
[]
[]
[]
[]
[]
[]
[]
[]
[]
[]
[]
[]
[]
[]
[]
[]
[]
[]
[]
[]
[]
[]
[]
[]
[]
[]
[]
[]
[]
[]
[]
[]
[]
[]
[]
[]
[]
[]
[]
[]
[]
[]
[]
[]
[]
[]
[]
[]
[]
[]
[]
[]
[]
[]
[]
[]
[]
[]
[]
[]
[]
[]
[]
[]
[]
[]
[]
[]
[]
[]
[]
[]
[]
[]
[]
[]
[]
[]
[]
[]
[]
[]
[]
[]
[]
[]
[]
[]
[]
[]
[]
[]
[]
[]
[]
[]
[]
[]
[]
[]
[]
[]
[]
[]
[]
[]
[]
[]
[]
[]
[]
[]
[]
[]
[]
[]
[]
[]
[]
[]
[]
[]
[]
[]
[]
[]
[]
[]
[]
[]
[]
[]
[]
[]
[]
[]
[]
[]
[]
[]
[]
[]
[]
[]
[]
[]
[]
[]
[]
[]
[]
[]
[]
[]
[]
[]
[]
[]
[]
[]
[]
[]
[]
[]
[]
[]
[]
[]
[]
[]
[]
[]
[]
[]
[]
[]
[]
[]
[]
[]
[]
[]
[]
[]
[]
[]
[]
[]
[]
[]
[]
[]
[]
[]
[]
[]
[]
[]
[]
[]
[]
[]
[]
[]
[]
[]
[]
[]
[]
[]
[]
[]
[]
[]
[]
[]
[]
[]
[]
[]
[]
[]
[]
[]
[]
[]
[]
[]
[]
[]
[]
[]
[]
[]
[]
[]
[]
[]
[]
[]
[]
[]
[]
[]
[]
[]
[]
[]
[]
[]
[]
[]
[]
[]
[]
[]
[]
[]
[]
[]
[]
[]
[]
[]
[]
[]
[]
[]
[]
[]
[]
[]
[]
[]
[]
[]
[]
[]
[]
[]
[]
[]
[]
[]
[]
[]
[]
[]
[]
[]
[]
[]
[]
[]
[]
[]
[]
[]
[]
[]
[]
[]
[]
[]
[]
[]
[]
[]
[]
[]
[]
[]
[]
[]
[]
[]
[]
[]
[]
[]
[]
[]
[]
[]
[]
[]
[]
[]
[]
[]
[]
[]
[]
[]
[]
[]
[]
[]
[]
[]
[]
[]
[]
[]
[]
[]
[]
[]
[]
[]
[]
[]
[]
[]
[]
[]
[]
[]
[]
[]
[]
[]
[]
[]
[]
[]
[]
[]
[]
[]
[]
[]
[]
[]
[]
[]
[]
[]
[]
[]
[]
[]
[]
[]
[]
[]
[]
[]
[]
[]
[]
[]
[]
[]
[]
[]
[]
[]
[]
[]
[]
[]
[]
[]
[]
[]
[]
[]
[]
[]
[]
[]
[]
[]
[]
[]
[]
[]
[]
[]
[]
[]
[]
[]
[]
[]
[]
[]
[]
[]
[]
[]
[]
[]
[]
[]
[]
[]
[]
[]
[]
[]
[]
[]
[]
[]
[]
[]
[]
[]
[]
[]
[]
[]
[]
[]
[]
[]
[]
[]
[]
[]
[]
[]
[]
[]
[]
[]
[]
[]
[]
[]
[]
[]
[]
[]
[]
[]
[]
[]
[]
[]
[]
[]
[]
[]
[]
[]
[]
[]
[]
[]
[]
[]
[]
[]
[]
[]
[]
[]
[]
[]
[]
[]
[]
[]
[]
[]
[]
[]
[]
[]
[]
[]
[]
[]
[]
[]
[]
[]
[]
[]
[]
[]
[]
[]
[]
[]
[]
[]
[]
[]
[]
[]
[]
[]
[]
[]
[]
[]
[]
[]
[]
[]
[]
[]
[]
[]
[]
[]
[]
[]
[]
[]
[]
[]
[]
[]
[]
[]
[]
[]
[]
[]
[]
[]
[]
[]
[]
[]
[]
[]
[]
[]
[]
[]
[]
[]
[]
[]
[]
[]
[]
[]
[]
[]
[]
[]
[]
[]
[]
[]
[]
[]
[]
[]
[]
[]
[]
[]
[]
[]
[]
[]
[]
[]
[]
[]
[]
[]
[]
[]
[]
[]
[]
[]
[]
[]
[]
[]
[]
[]
[]
[]
[]
[]
[]
[]
[]
[]
[]
[]
[]
[]
[]
[]
[]
[]
[]
[]
[]
[]
[]
[]
[]
[]
[]
[]
[]
[]
[]
[]
[]
[]
[]
[]
[]
[]
[]
[]
[]
[]
[]
[]
[]
[]
[]
[]
[]
[]
[]
[]
[]
[]
[]
[]
[]
[]
[]
[]
[]
[]
[]
[]
[]
[]
[]
[]
[]
[]
[]
[]
[]
[]
[]
[]
[]
[]
[]
[]
[]
[]
[]
[]
[]
[]
[]
[]
[]
[]
[]
[]
[]
[]
[]
[]
[]
[]
[]
[]
[]
[]
[]
[]
[]
[]
[]
[]
[]
[]
[]
[]
[]
[]
[]
[]
[]
[]
[]
[]
[]
[]
[]
[]
[]
[]
[]
[]
[]
[]
[]
[]
[]
[]
[]
[]
[]
[]
[]
[]
[]
[]
[]
[]
[]
[]
[]
[]
[]
[]
[]
[]
[]
[]
[]
[]
[]
[]
[]
[]
[]
[]
[]
[]
[]
[]
[]
[]
[]
[]
[]
[]
[]
[]
[]
[]
[]
[]
[]
[]
[]
[]
[]
[]
[]
[]
[]
[]
[]
[]
[]
[]
[]
[]
[]
[]
[]
[]
[]
[]
[]
[]
[]
[]
[]
[]
[]
[]
[]
[]
[]
[]
[]
[]
[]
[]
[]
[]
[]
[]
[]
[]
[]
[]
[]
[]
[]
[]
[]
[]
[]
[]
[]
[]
[]
[]
[]
[]
[]
[]
[]
[]
[]
[]
[]
[]
[]
[]
[]
[]
[]
[]
[]
[]
[]
[]
[]
[]
[]
[]
[]
[]
[]
[]
[]
[]
[]
[]
[]
[]
[]
[]
[]
[]
[]
[]
[]
[]
[]
[]
[]
[]
[]
[]
[]
[]
[]
[]
[]
[]
[]
[]
[]
[]
[]
[]
[]
[]
[]
[]
[]
[]
[]
[]
[]
[]
[]
[]
[]
[]
[]
[]
[]
[]
[]
[]
[]
[]
[]
[]
[]
[]
[]
[]
[]
[]
[]
[]
[]
[]
[]
[]
[]
[]
[]
[]
[]
[]
[]
[]
[]
[]
[]
[]
[]
[]
[]
[]
[]
[]
[]
[]
[]
[]
[]
[]
[]
[]
[]
[]
[]
[]
[]
[]
[]
[]
[]
[]
[]
[]
[]
[]
[]
[]
[]
[]
[]
[]
[]
[]
[]
[]
[]
[]
[]
[]
[]
[]
[]
[]
[]
[]
[]
[]
[]
[]
[]
[]
[]
[]
[]
[]
[]
[]
[]
[]
[]
[]
[]
[]
[]
[]
[]
[]
[]
[]
[]
[]
[]
[]
[]
[]
[]
[]
[]
[]
[]
[]
[]
[]
[]
[]
[]
[]
[]
[]
[]
[]
[]
[]
[]
[]
[]
[]
[]
[]
[]
[]
[]
[]
[]
[]
[]
[]
[]
[]
[]
[]
[]
[]
[]
[]
[]
[]
[]
[]
[]
[]
[]
[]
[]
[]
[]
[]
[]
[]
[]
[]
[]
[]
[]
[]
[]
[]
[]
[]
[]
[]
[]
[]
[]
[]
[]
[]
[]
[]
[]
[]
[]
[]
[]
[]
[]
[]
[]
[]
[]
[]
[]
[]
[]
[]
[]
[]
[]
[]
[]
[]
[]
[]
[]
[]
[]
[]
[]
[]
[]
[]
[]
[]
[]
[]
[]
[]
[]
[]
[]
[]
[]
[]
[]
[]
[]
[]
[]
[]
[]
[]
[]
[]
[]
[]
[]
[]
[]
[]
[]
[]
[]
[]
[]
[]
[]
[]
[]
[]
[]
[]
[]
[]
[]
[]
[]
[]
[]
[]
[]
[]
[]
[]
[]
[]
[]
[]
[]
[]
[]
[]
[]
[]
[]
[]
[]
[]
[]
[]
[]
[]
[]
[]
[]
[]
[]
[]
[]
[]
[]
[]
[]
[]
[]
[]
[]
[]
[]
[]
[]
[]
[]
[]
[]
[]
[]
[]
[]
[]
[]
[]
[]
[]
[]
[]
[]
[]
[]
[]
[]
[]
[]
[]
[]
[]
[]
[]
[]
[]
[]
[]
[]
[]
[]
[]
[]
[]
[]
[]
[]
[]
[]
[]
[]
[]
[]
[]
[]
[]
[]
[]
[]
[]
[]
[]
[]
[]
[]
[]
[]
[]
[]
[]
[]
[]
[]
[]
[]
[]
[]
[]
[]
[]
[]
[]
[]
[]
[]
[]
[]
[]
[]
[]
[]
[]
[]
[]
[]
[]
[]
[]
[]
[]
[]
[]
[]
[]
[]
[]
[]
[]
[]
[]
[]
[]
[]
[]
[]
[]
[]
[]
[]
[]
[]
[]
[]
[]
[]
[]
[]
[]
[]
[]
[]
[]
[]
[]
[]
[]
[]
[]
[]
[]
[]
[]
[]
[]
[]
[]
[]
[]
[]
[]
[]
[]
[]
[]
[]
[]
[]
[]
[]
[]
[]
[]
[]
[]
[]
[]
[]
[]
[]
[]
[]
[]
[]
[]
[]
[]
[]
[]
[]
[]
[]
[]
[]
[]
[]
[]
[]
[]
[]
[]
[]
[]
[]
[]
[]
[]
[]
[]
[]
[]
[]
[]
[]
[]
[]
[]
[]
[]
[]
[]
[]
[]
[]
[]
[]
[]
[]
[]
[]
[]
[]
[]
[]
[]
[]
[]
[]
[]
[]
[]
[]
[]
[]
[]
[]
[]
[]
[]
[]
[]
[]
[]
[]
[]
[]
[]
[]
[]
[]
[]
[]
[]
[]
[]
[]
[]
[]
[]
[]
[]
[]
[]
[]
[]
[]
[]
[]
[]
[]
[]
[]
[]
[]
[]
[]
[]
[]
[]
[]
[]
[]
[]
[]
[]
[]
[]
[]
[]
[]
[]
[]
[]
[]
[]
[]
[]
[]
[]
[]
[]
[]
[]
[]
[]
[]
[]
[]
[]
[]
[]
[]
[]
[]
[]
[]
[]
[]
[]
[]
[]
[]
[]
[]
[]
[]
[]
[]
[]
[]
[]
[]
[]
[]
[]
[]
[]
[]
[]
[]
[]
[]
[]
[]
[]
[]
[]
[]
[]
[]
[]
[]
[]
[]
[]
[]
[]
[]
[]
[]
[]
[]
[]
[]
[]
[]
[]
[]
[]
[]
[]
[]
[]
[]
[]
[]
[]
[]
[]
[]
[]
[]
[]
[]
[]
[]
[]
[]
[]
[]
[]
[]
[]
[]
[]
[]
[]
[]
[]
[]
[]
[]
[]
[]
[]
[]
[]
[]
[]
[]
[]
[]
[]
[]
[]
[]
[]
[]
[]
[]
[]
[]
[]
[]
[]
[]
[]
[]
[]
[]
[]
[]
[]
[]
[]
[]
[]
[]
[]
[]
[]
[]
[]
[]
[]
[]
[]
[]
[]
[]
[]
[]
[]
[]
[]
[]
[]
[]
[]
[]
[]
[]
[]
[]
[]
[]
[]
[]
[]
[]
[]
[]
[]
[]
[]
[]
[]
[]
[]
[]
[]
[]
[]
[]
[]
[]
[]
[]
[]
[]
[]
[]
[]
[]
[]
[]
[]
[]
[]
[]
[]
[]
[]
[]
[]
[]
[]
[]
[]
[]
[]
[]
[]
[]
[]
[]
[]
[]
[]
[]
[]
[]
[]
[]
[]
[]
[]
[]
[]
[]
[]
[]
[]
[]
[]
[]
[]
[]
[]
[]
[]
[]
[]
[]
[]
[]
[]
[]
[]
[]
[]
[]
[]
[]
[]
[]
[]
[]
[]
[]
[]
[]
[]
[]
[]
[]
[]
[]
[]
[]
[]
[]
[]
[]
[]
[]
[]
[]
[]
[]
[]
[]
[]
[]
[]
[]
[]
[]
[]
[]
[]
[]
[]
[]
[]
[]
[]
[]
[]
[]
[]
[]
[]
[]
[]
[]
[]
[]
[]
[]
[]
[]
[]
[]
[]
[]
[]
[]
[]
[]
[]
[]
[]
[]
[]
[]
[]
[]
[]
[]
[]
[]
[]
[]
[]
[]
[]
[]
[]
[]
[]
[]
[]
[]
[]
[]
[]
[]
[]
[]
[]
[]
[]
[]
[]
[]
[]
[]
[]
[]
[]
[]
[]
[]
[]
[]
[]
[]
[]
[]
[]
[]
[]
[]
[]
[]
[]
[]
[]
[]
[]
[]
[]
[]
[]
[]
[]
[]
[]
[]
[]
[]
[]
[]
[]
[]
[]
[]
[]
[]
[]
[]
[]
[]
[]
[]
[]
[]
[]
[]
[]
[]
[]
[]
[]
[]
[]
[]
[]
[]
[]
[]
[]
[]
[]
[]
[]
[]
[]
[]
[]
[]
[]
[]
[]
[]
[]
[]
[]
[]
[]
[]
[]
[]
[]
[]
[]
[]
[]
[]
[]
[]
[]
[]
[]
[]
[]
[]
[]
[]
[]
[]
[]
[]
[]
[]
[]
[]
[]
[]
[]
[]
[]
[]
[]
[]
[]
[]
[]
[]
[]
[]
[]
[]
[]
[]
[]
[]
[]
[]
[]
[]
[]
[]
[]
[]
[]
[]
[]
[]
[]
[]
[]
[]
[]
[]
[]
[]
[]
[]
[]
[]
[]
[]
[]
[]
[]
[]
[]
[]
[]
[]
[]
[]
[]
[]
[]
[]
[]
[]
[]
[]
[]
[]
[]
[]
[]
[]
[]
[]
[]
[]
[]
[]
[]
[]
[]
[]
[]
[]
[]
[]
[]
[]
[]
[]
[]
[]
[]
[]
[]
[]
[]
[]
[]
[]
[]
[]
[]
[]
[]
[]
[]
[]
[]
[]
[]
[]
[]
[]
[]
[]
[]
[]
[]
[]
[]
[]
[]
[]
[]
[]
[]
[]
[]
[]
[]
[]
[]
[]
[]
[]
[]
[]
[]
[]
[]
[]
[]
[]
[]
[]
[]
[]
[]
[]
[]
[]
[]
[]
[]
[]
[]
[]
[]
[]
[]
[]
[]
[]
[]
[]
[]
[]
[]
[]
[]
[]
[]
[]
[]
[]
[]
[]
[]
[]
[]
[]
[]
[]
[]
[]
[]
[]
[]
[]
[]
[]
[]
[]
[]
[]
[]
[]
[]
[]
[]
[]
[]
[]
[]
[]
[]
[]
[]
[]
[]
[]
[]
[]
[]
[]
[]
[]
[]
[]
[]
[]
[]
[]
[]
[]
[]
[]
[]
[]
[]
[]
[]
[]
[]
[]
[]
[]
[]
[]
[]
[]
[]
[]
[]
[]
[]
[]
[]
[]
[]
[]
[]
[]
[]
[]
[]
[]
[]
[]
[]
[]
[]
[]
[]
[]
[]
[]
[]
[]
[]
[]
[]
[]
[]
[]
[]
[]
[]
[]
[]
[]
[]
[]
[]
[]
[]
[]
[]
[]
[]
[]
[]
[]
[]
[]
[]
[]
[]
[]
[]
[]
[]
[]
[]
[]
[]
[]
[]
[]
[]
[]
[]
[]
[]
[]
[]
[]
[]
[]
[]
[]
[]
[]
[]
[]
[]
[]
[]
[]
[]
[]
[]
[]
[]
[]
[]
[]
[]
[]
[]
[]
[]
[]
[]
[]
[]
[]
[]
[]
[]
[]
[]
[]
[]
[]
[]
[]
[]
[]
[]
[]
[]
[]
[]
[]
[]
[]
[]
[]
[]
[]
[]
[]
[]
[]
[]
[]
[]
[]
[]
[]
[]
[]
[]
[]
[]
[]
[]
[]
[]
[]
[]
[]
[]
[]
[]
[]
[]
[]
[]
[]
[]
[]
[]
[]
[]
[]
[]
[]
[]
[]
[]
[]
[]
[]
[]
[]
[]
[]
[]
[]
[]
[]
[]
[]
[]
[]
[]
[]
[]
[]
[]
[]
[]
[]
[]
[]
[]
[]
[]
[]
[]
[]
[]
[]
[]
[]
[]
[]
[]
[]
[]
[]
[]
[]
[]
[]
[]
[]
[]
[]
[]
[]
[]
[]
[]
[]
[]
[]
[]
[]
[]
[]
[]
[]
[]
[]
[]
[]
[]
[]
[]
[]
[]
[]
[]
[]
[]
[]
[]
[]
[]
[]
[]
[]
[]
[]
[]
[]
[]
[]
[]
[]
[]
[]
[]
[]
[]
[]
[]
[]
[]
[]
[]
[]
[]
[]
[]
[]
[]
[]
[]
[]
[]
[]
[]
[]
[]
[]
[]
[]
[]
[]
[]
[]
[]
[]
[]
[]
[]
[]
[]
[]
[]
[]
[]
[]
[]
[]
[]
[]
[]
[]
[]
[]
[]
[]
[]
[]
[]
[]
[]
[]
[]
[]
[]
[]
[]
[]
[]
[]
[]
[]
[]
[]
[]
[]
[]
[]
[]
[]
[]
[]
[]
[]
[]
[]
[]
[]
[]
[]
[]
[]
[]
[]
[]
[]
[]
[]
[]
[]
[]
[]
[]
[]
[]
[]
[]
[]
[]
[]
[]
[]
[]
[]
[]
[]
[]
[]
[]
[]
[]
[]
[]
[]
[]
[]
[]
[]
[]
[]
[]
[]
[]
[]
[]
[]
[]
[]
[]
[]
[]
[]
[]
[]
[]
[]
[]
[]
[]
[]
[]
[]
[]
[]
[]
[]
[]
[]
[]
[]
[]
[]
[]
[]
[]
[]
[]
[]
[]
[]
[]
[]
[]
[]
[]
[]
[]
[]
[]
[]
[]
[]
[]
[]
[]
[]
[]
[]
[]
[]
[]
[]
[]
[]
[]
[]
[]
[]
[]
[]
[]
[]
[]
[]
[]
[]
[]
[]
[]
[]
[]
[]
[]
[]
[]
[]
[]
[]
[]
[]
[]
[]
[]
[]
[]
[]
[]
[]
[]
[]
[]
[]
[]
[]
[]
[]
[]
[]
[]
[]
[]
[]
[]
[]
[]
[]
[]
[]
[]
[]
[]
[]
[]
[]
[]
[]
[]
[]
[]
[]
[]
[]
[]
[]
[]
[]
[]
[]
[]
[]
[]
[]
[]
[]
[]
[]
[]
[]
[]
[]
[]
[]
[]
[]
[]
[]
[]
[]
[]
[]
[]
[]
[]
[]
[]
[]
[]
[]
[]
[]
[]
[]
[]
[]
[]
[]
[]
[]
[]
[]
[]
[]
[]
[]
[]
[]
[]
[]
[]
[]
[]
[]
[]
[]
[]
[]
[]
[]
[]
[]
[]
[]
[]
[]
[]
[]
[]
[]
[]
[]
[]
[]
[]
[]
[]
[]
[]
[]
[]
[]
[]
[]
[]
[]
[]
[]
[]
[]
[]
[]
[]
[]
[]
[]
[]
[]
[]
[]
[]
[]
[]
[]
[]
[]
[]
[]
[]
[]
[]
[]
[]
[]
[]
[]
[]
[]
[]
[]
[]
[]
[]
[]
[]
[]
[]
[]
[]
[]
[]
[]
[]
[]
[]
[]
[]
[]
[]
[]
[]
[]
[]
[]
[]
[]
[]
[]
[]
[]
[]
[]
[]
[]
[]
[]
[]
[]
[]
[]
[]
[]
[]
[]
[]
[]
[]
[]
[]
[]
[]
[]
[]
[]
[]
[]
[]
[]
[]
[]
[]
[]
[]
[]
[]
[]
[]
[]
[]
[]
[]
[]
[]
[]
[]
[]
[]
[]
[]
[]
[]
[]
[]
[]
[]
[]
[]
[]
[]
[]
[]
[]
[]
[]
[]
[]
[]
[]
[]
[]
[]
[]
[]
[]
[]
[]
[]
[]
[]
[]
[]
[]
[]
[]
[]
[]
[]
[]
[]
[]
[]
[]
[]
[]
[]
[]
[]
[]
[]
[]
[]
[]
[]
[]
[]
[]
[]
[]
[]
[]
[]
[]
[]
[]
[]
[]
[]
[]
[]
[]
[]
[]
[]
[]
[]
[]
[]
[]
[]
[]
[]
[]
[]
[]
[]
[]
[]
[]
[]
[]
[]
[]
[]
[]
[]
[]
[]
[]
[]
[]
[]
[]
[]
[]
[]
[]
[]
[]
[]
[]
[]
[]
[]
[]
[]
[]
[]
[]
[]
[]
[]
[]
[]
[]
[]
[]
[]
[]
[]
[]
[]
[]
[]
[]
[]
[]
[]
[]
[]
[]
[]
[]
[]
[]
[]
[]
[]
[]
[]
[]
[]
[]
[]
[]
[]
[]
[]
[]
[]
[]
[]
[]
[]
[]
[]
[]
[]
[]
[]
[]
[]
[]
[]
[]
[]
[]
[]
[]
[]
[]
[]
[]
[]
[]
[]
[]
[]
[]
[]
[]
[]
[]
[]
[]
[]
[]
[]
[]
[]
[]
[]
[]
[]
[]
[]
[]
[]
[]
[]
[]
[]
[]
[]
[]
[]
[]
[]
[]
[]
[]
[]
[]
[]
[]
[]
[]
[]
[]
[]
[]
[]
[]
[]
[]
[]
[]
[]
[]
[]
[]
[]
[]
[]
[]
[]
[]
[]
[]
[]
[]
[]
[]
[]
[]
[]
[]
[]
[]
[]
[]
[]
[]
[]
[]
[]
[]
[]
[]
[]
[]
[]
[]
[]
[]
[]
[]
[]
[]
[]
[]
[]
[]
[]
[]
[]
[]
[]
[]
[]
[]
[]
[]
[]
[]
[]
[]
[]
[]
[]
[]
[]
[]
[]
[]
[]
[]
[]
[]
[]
[]
[]
[]
[]
[]
[]
[]
[]
[]
[]
[]
[]
[]
[]
[]
[]
[]
[]
[]
[]
[]
[]
[]
[]
[]
[]
[]
[]
[]
[]
[]
[]
[]
[]
[null,null,null,null,null,null,null,null,null,null,null,null,"`"]

{"sheet":"BHC","index":5,"n_rows":19,"n_cols":30,"rows_kept":19,"cut":false,"hidden":true,"merged":[]}
[]
[]
[]
[null,null,null,null,null,null,null,null,null,null,null,"MDI flag","Tier 1 Capital","CET1 Capital","Total Capital","Total assets for leverage ratio","SA RWA","CET1 RBC ratio","Tier 1 RBC ratio","Total RBC ratio","Leverage ratio","Cash, Noninterest-bearing balances and currency and coin","Cash, Interest-bearing balances","Total loans, domestic","Securities, HTM","Securities, AFS","Securities, equities","Trading assets","Intangible assets","Parent of an MDI or CDFI IDI?"]
["CALLYMD","RSSDID","NAMEHC","STALPHC","TOPFILER","TOPHC","ENTTYPEH","BHC","ASSET","CBLRIND","SUBCHAPS","MNRTYCDE","RBCT1W","RBCT1C","RBCW","AVASSETW","HCR40A","RBCT1CER","RBC1RWAJ","RBCRWAJ","RBC1AAJ","CHBALNI","CHBALI","LNLSGRD","SCHANET","SCAF","SCEQFV","TRADE","INTAN","CDFI_MDI_holdco"]
[20210331,1097306,"BANCPLUS CORP","MS",1,1,"BHC",1,4951264,0,0,0,403300,352466,502021,4803987,3509917,10.039999999999999,11.49,14.3,8.4,98920,483155,3427393,90818,572888,0,0,8258,{"$f":"IFERROR(VLOOKUP(B6, IDI!$L$6:$L$7000, 1, FALSE)/VLOOKUP(B6, IDI!$L$6:$L$7000, 1, FALSE), 0)","v":1}]
[20210331,1104231,"INTERNATIONAL BANCSHARES CORP","TX",1,1,"FHD",1,14921535,0,0,0,2007469,1892259,2119550,13821190,9820729,19.27,20.440000000000001,21.58,14.52,329809,1637961,7462359,3400,4057356,6126,0,284078,{"$f":"IFERROR(VLOOKUP(B7, IDI!$L$6:$L$7000, 1, FALSE)/VLOOKUP(B7, IDI!$L$6:$L$7000, 1, FALSE), 0)","v":1}]
[20210331,1129382,"POPULAR INC","PR",1,1,"FHD",1,66870000,0,0,0,5274000,5252000,6033000,65460000,30745000,17.079999999999998,17.149999999999999,19.62,8.06,496000,11568000,23807000,293000,22772000,32000,36000,815000,{"$f":"IFERROR(VLOOKUP(B8, IDI!$L$6:$L$7000, 1, FALSE)/VLOOKUP(B8, IDI!$L$6:$L$7000, 1, FALSE), 0)","v":1}]
[20210331,1136661,"OCEAN BANKSHARES INC","FL",1,1,"BHC",1,4709246,0,0,0,479526,479526,569423,4568312,3851965,12.45,12.45,14.78,10.5,37579,366730,3737679,0,380531,1964,0,1532,{"$f":"IFERROR(VLOOKUP(B9, IDI!$L$6:$L$7000, 1, FALSE)/VLOOKUP(B9, IDI!$L$6:$L$7000, 1, FALSE), 0)","v":1}]
[20210331,1843080,"CATHAY GENERAL BCORP","CA",1,1,"BHC",1,19230188,0,0,0,2066900,2066900,2334634,18605062,14760804,14,14,15.82,11.11,141884,1612411,15403569,0,908844,20993,0,377438,{"$f":"IFERROR(VLOOKUP(B10, IDI!$L$6:$L$7000, 1, FALSE)/VLOOKUP(B10, IDI!$L$6:$L$7000, 1, FALSE), 0)","v":1}]
[20210331,1995523,"M&F BCORP INC","MS",1,1,"BHC",1,126584,1,1,0,13745,13745,null,121992,null,null,null,null,11.27,4134,16735,48916,0,49220,0,0,0,{"$f":"IFERROR(VLOOKUP(B11, IDI!$L$6:$L$7000, 1, FALSE)/VLOOKUP(B11, IDI!$L$6:$L$7000, 1, FALSE), 0)","v":1}]
[20210331,2385493,"FIRST BANCSHARES INC THE","MS",1,1,"FHD",1,5445729,0,0,0,462638,447324,623063,5156839,3230957,13.84,14.32,19.28,8.9700000000000006,117269,695738,3070212,0,1135188,0,0,186648,{"$f":"IFERROR(VLOOKUP(B12, IDI!$L$6:$L$7000, 1, FALSE)/VLOOKUP(B12, IDI!$L$6:$L$7000, 1, FALSE), 0)","v":1}]
[20210331,2490575,"OFG BCORP","PR",1,1,"FHD",1,10153342,0,0,0,1036726,919856,1121829,9890379,6782685,13.56,15.28,16.54,10.48,58687,2306197,6634052,126767,471009,12423,24,177425,{"$f":"IFERROR(VLOOKUP(B13, IDI!$L$6:$L$7000, 1, FALSE)/VLOOKUP(B13, IDI!$L$6:$L$7000, 1, FALSE), 0)","v":1}]
[20210331,2531245,"CARVER BCORP INC","NY",1,1,"THC",0,676748,0,0,0,68593,29412,73938,665219,455334,6.46,15.06,16.239999999999998,10.31,3286,72305,483548,7807,86507,0,0,147,{"$f":"IFERROR(VLOOKUP(B14, IDI!$L$6:$L$7000, 1, FALSE)/VLOOKUP(B14, IDI!$L$6:$L$7000, 1, FALSE), 0)","v":1}]
[20210331,2734233,"EAST WEST BCORP INC","CA",1,1,"FHD",1,56874146,0,0,0,5028584,5028584,5647260,55223385,39572396,12.71,12.71,14.27,9.11,587465,4773591,38978591,0,7789213,26693,0,476848,{"$f":"IFERROR(VLOOKUP(B15, IDI!$L$6:$L$7000, 1, FALSE)/VLOOKUP(B15, IDI!$L$6:$L$7000, 1, FALSE), 0)","v":1}]
[20210331,2744894,"FIRST BCORP","PR",1,1,"FHD",1,19413734,0,0,0,2151302,2115198,2479823,18937118,11961350,17.68,17.989999999999998,20.73,11.36,114392,1403772,11547042,180811,5406790,5445,0,109708,{"$f":"IFERROR(VLOOKUP(B16, IDI!$L$6:$L$7000, 1, FALSE)/VLOOKUP(B16, IDI!$L$6:$L$7000, 1, FALSE), 0)","v":1}]
[20210331,2900261,"HANMI FINANCIAL CORP","CA",1,1,"BHC",1,6438401,0,0,0,596129,575601,755929,6205367,4863528,11.84,12.26,15.54,9.61,55136,591309,4849825,0,780114,0,1354,17708,{"$f":"IFERROR(VLOOKUP(B17, IDI!$L$6:$L$7000, 1, FALSE)/VLOOKUP(B17, IDI!$L$6:$L$7000, 1, FALSE), 0)","v":1}]
[20210331,2961879,"HOPE BCORP INC","CA",1,1,"BHC",1,17198922,0,0,0,1688729,1588161,1867994,16630746,14338828,11.08,11.78,13.03,10.15,138149,326863,13722301,0,2233745,27128,0,485732,{"$f":"IFERROR(VLOOKUP(B18, IDI!$L$6:$L$7000, 1, FALSE)/VLOOKUP(B18, IDI!$L$6:$L$7000, 1, FALSE), 0)","v":1}]
[20210331,4176855,"RBB BCORP","CA",1,1,"FHD",1,3664299,0,0,0,377094,362756,580891,3335646,2496374,14.53,15.11,23.27,11.3,32822,330708,2809880,6668,281581,0,0,87402,{"$f":"IFERROR(VLOOKUP(B19, IDI!$L$6:$L$7000, 1, FALSE)/VLOOKUP(B19, IDI!$L$6:$L$7000, 1, FALSE), 0)","v":1}]