{"text_format":"1","workbook":"xlsx","n_sheets":6,"sheets":["Instructions","IDI_Estimator","BHC_Estimator","Info","IDI","BHC"],"not_rendered":{"charts":0,"images":0,"macros":1,"external_links":0,"defined_names":31,"comments":0,"pivot_tables":0},"unopened":[],"bounds":{"document_bytes":16777216,"sheet_cells":100000,"rows_first":2000,"rows_last":500,"rows_between":2000,"halvings":0,"cell_chars":16384,"cell_head_chars":4096},"cells_cut":0,"cells_raw":0,"read":"whole","date_system":"1900"}

{"sheet":"Instructions","index":0,"n_rows":15,"n_cols":2,"rows_kept":15,"cut":false,"hidden":false,"merged":[[11,1,11,3],[0,0,0,3],[5,1,5,3],[7,1,7,3],[9,1,9,3],[1,1,1,3]]}
["Instructions for Completing the MDI/CDFI Capital Investment Estimation Tool "]
[null,"This tool estimates the effects of new capital investments on the ratios of Insured Depository Institutions (IDIs) and Bank Holding Companies (BHCs) related to new capital investments in Minority Depository Institutions (MDIs) and Community Development Financial Institutions (CDFIs). The tool has two separate tabs, \"IDI_Estimator\" to estimate IDI capital ratio effects, and \"BHC_Estimator\" to estimate BHC capital ratio effects. The tool may be used to estimate changes in IDI capital ratios due to a new capital investment at the BHC level that is downstreamed to the IDI. However, the downstreaming effect from a parent BHC to a subsidiary IDI is not automatically part of the tool; any effect from downstreaming capital to the IDI must be estimated separately in the IDI_Estimator tab.\n\nThis tool is designed solely for gauging the estimated regulatory capital ratio impact of new capital investments in MDIs/CDFIs and does not purport to predict an MDI or CDFI’s actual risk-based capital and leverage ratios. This tool is not a substitute for the MDI or CDFI’s own analysis of the impact of the new capital investment on its financial operations for regulatory reporting and related capital planning purposes. A particular MDI or CDFI’s risk-based capital and leverage ratios after a new capital investment, as reported in its FR Y-9C Schedule HC-R or Call Report Schedule RC-R, as applicable, may vary from the estimates produced using this tool."]
[]
["Step 1","For the IDI Estimator: Input the Certificate Number in the IDI_Estimator tab in cell B2.\nFor the BHC Estimator: Input the RSSD ID in the BHC_Estimator tab in cell B2."]
[]
["Step 2","Choose capital investment type(s) and enter in yellow cells M11 through M15. Enter amounts in thousands, using whole numbers and omitting decimal places. For cells corresponding to capital types in which no investment type is planned, enter 0 or leave blank."]
[]
["Step 3","Choose the risk weights that will apply to the assets funded by the capital investment, and enter the amounts in yellow cells D21 through M21. Enter amounts in thousands, using whole numbers and omitting decimal places. For cells corresponding to risk-weights for which no new capital investments will be used, enter 0 or leave blank. For CBLR-electing banks, risk-based capital ratios do not apply and risk-weighted assets are not calculated; therefore, cells D21 through M21 should be left blank."]
[]
["Step 4","View the post-investment capital and leverage ratios (or just leverage ratio for CBLR-electing banks) in cells F26 through I26. Cells immediately below F26 through I26 will display information about the ratios and if they exceed certain thresholds. See explanatory notes below the cells for more information."]
[]
["Notes:","Data in the underlying tool is based on 1st quarter 2021 regulatory reported data, sourced on May 21, 2021. \nThe estimates for holding companies derive from preliminary 1st quarter 2021 Y-9C data, which may be amended before finalization. Therefore, the estimates derived from the holding company tab may be affected by amendments to the Y-9C data related to a holding company's capital and leverage ratio items."]
[null,"Version: 20210521"]
[]
[null,"If there are any questions related to the tool, please contact Kyle McCormick at kmccormick@FDIC.gov"]
{"$rows_left_out":1}
{"sheet":"IDI_Estimator","index":1,"n_rows":39,"n_cols":15,"rows_kept":39,"cut":false,"hidden":false,"merged":[[37,0,37,16],[1,5,1,8],[14,3,15,4],[38,0,38,16],[2,5,2,7],[2,8,3,8],[32,0,32,16],[10,5,10,11],[11,5,11,11],[12,5,13,11],[14,5,15,11],[9,3,9,4],[9,5,9,11],[5,3,5,4],[6,3,6,4],[10,3,10,4],[11,3,11,4],[12,3,13,4],[23,8,24,8],[23,5,23,7],[22,5,22,8],[31,0,31,16],[33,0,33,16],[34,0,34,16],[36,0,36,16],[26,3,26,4],[27,3,27,4],[28,3,28,4],[35,0,35,16]]}
[]
["Step 1: Enter MDI or CDFI Cert:",null,null,null,null,"Current capital ratios"]
["Name",{"$f":"IFERROR(VLOOKUP(B2, IDI!$B$6:$D$7000, COLUMN(IDI!$D$5)-COLUMN(IDI!$A$5), FALSE), \"\")","v":""},null,null,null,"Risk-based ratios",null,null,"Leverage ratio"]
[{"$f":"IFERROR(IF(VLOOKUP(B2, IDI!B6:AJ7000, COLUMN(IDI!AJ5)-COLUMN(IDI!A5), FALSE)=1, \"\", \"ERROR: Cert chosen is not an MDI or CDFI\"), \"ERROR: Cert chosen is not an MDI or CDFI\")","v":"ERROR: Cert chosen is not an MDI or CDFI"},null,null,null,null,"CET1","Tier 1","Total"]
[{"$f":"\"Reported bank information, \"&IF(RIGHT(MAX(IDI!A6:A10000),4)=\"0331\", \"1Q\", IF(RIGHT(MAX(IDI!A6:A10000),4)=\"0630\", \"2Q\", IF(RIGHT(MAX(IDI!A6:A10000),4)=\"0930\", \"3Q\",IF(RIGHT(MAX(IDI!A6:A10000),4)=\"1231\", \"4Q\", \"     ERROR     \"))))&LEFT(MAX(IDI!A6:A10000), 4)&\" ($ th.)\"","v":"Reported bank information, 1Q2021 ($ th.)"},null,null,null,null,{"$f":"IFERROR(IF(B9=\"Yes\", \"NA\", VLOOKUP(B2, IDI!$B$6:$V$7000, COLUMN(IDI!$V$5)-COLUMN(IDI!$A$5), FALSE)/100 ), \"\")","v":""},{"$f":"IFERROR(IF(B9=\"Yes\", \"NA\", VLOOKUP(B2, IDI!$B$6:$W$7000, COLUMN(IDI!$W$5)-COLUMN(IDI!$A$5), FALSE)/100 ), \"\")","v":""},{"$f":"IFERROR(IF(B9=\"Yes\", \"NA\", VLOOKUP(B2, IDI!$B$6:$X$7000, COLUMN(IDI!$X$5)-COLUMN(IDI!$A$5), FALSE)/100 ), \"\")","v":""},{"$f":"IFERROR(VLOOKUP(B2, IDI!$B$6:$Y$7000, COLUMN(IDI!$Y$5)-COLUMN(IDI!$A$5), FALSE)/100, \"\")","v":""}]
["State",{"$f":"IFERROR(VLOOKUP(B2, IDI!$B$6:$G$7000, COLUMN(IDI!$G$5)-COLUMN(IDI!$A$5), FALSE), \"\")","v":""},null,"PCA category4",null,{"$f":"IF(B11=\"\", \"\", IF(B9=\"Yes\",\"NA\", IF(F5>=6.5%, \"Well\", IF(AND(F5>=4.5%, F5<6.5%), \"Adeq\", IF(AND(F5>=3%, F5<4.5%), \"Under\", IF(F5<3%, \"Sig Under\")))) ))","v":""},{"$f":"IF(B11=\"\", \"\", IF(B9=\"Yes\",\"NA\", IF(G5>=8%, \"Well\", IF(AND(G5>=6%, G5<8%), \"Adeq\", IF(AND(G5>=4%, G5<6%), \"Under\", IF(G5<4%, \"Sig Under\")))) ))","v":""},{"$f":"IF(B11=\"\", \"\", IF(B9=\"Yes\",\"NA\",  IF(H5>=10%, \"Well\", IF(AND(H5>=8%, H5<10%), \"Adeq\", IF(AND(H5>=6%, H5<8%), \"Under\", IF(H5<6%, \"Sig Under\")))) ))","v":""},{"$f":"IF(B11=\"\", \"\", IF(B9=\"Yes\",IF(I5>8.5%,\"Well\",IF(AND(I5>7.5%,I5<=8.5%),\"Grace period\",\"Disq. from CBLR\")),IF(B9<>\"Yes\",IF(I5>=5%,\"Well\",IF(AND(I5>=4%,I5<5%),\"Adeq\",IF(AND(I5>=3%,I5<4%),\"Under\",IF(I5<3%,\"Sig under\")))))))","v":""}]
["PFR",{"$f":"IFERROR(VLOOKUP(B2, IDI!$B$6:$H$7000, COLUMN(IDI!$H$5)-COLUMN(IDI!$A$5), FALSE), \"\")","v":""},null,"Exceeds CCB?",null,{"$f":"IF(B11=\"\", \"\", IF($B9=\"Yes\",\"NA\", IF(F5>7%, \"Yes\", \"No\")))","v":""},{"$f":"IF(B11=\"\", \"\", IF($B9=\"Yes\",\"NA\", IF(G5>8.5%, \"Yes\", \"No\")))","v":""},{"$f":"IF(B11=\"\", \"\", IF($B9=\"Yes\",\"NA\", IF(H5>10.5%, \"Yes\", \"No\")))","v":""},"NA"]
["FDIC region",{"$f":"IFERROR(VLOOKUP(VLOOKUP(B2, IDI!$B$6:$K$7000, COLUMN(IDI!$K$5)-COLUMN(IDI!$A$5), FALSE), Info!K4:M11, 3, FALSE), \"\")","v":""}]
["CBLR bank?1",{"$f":"IFERROR(IF(VLOOKUP(B2, IDI!$B$6:$N$7000, COLUMN(IDI!$N$5)-COLUMN(IDI!$A$5), FALSE)=1, \"Yes\", \"No\"), \"\")","v":""},null,"Step 2: Choose investment type(s) and amount ($ th.)"]
["S-Corporation bank?2",{"$f":"IFERROR(IF(VLOOKUP(B2, IDI!$B$6:$AG$7000, COLUMN(IDI!$O$5)-COLUMN(IDI!$A$5), FALSE)=1, \"Yes\", \"No\"), \"\")","v":""},null,"Capital type",null,"Qualifying instruments5",null,null,null,null,null,null,"Amount, $ th."]
["Assets",{"$f":"IFERROR(VLOOKUP(B2, IDI!$B$6:$AG$7000, COLUMN(IDI!$F$5)-COLUMN(IDI!$A$5), FALSE), \"\")","v":""},null,"CET1",null,"Common stock, surplus and retained earnings",null,null,null,null,null,null,0]
["Risk weighted assets (RWA)",{"$f":"IFERROR(IF(B9=\"Yes\", \"NA\", VLOOKUP(B2, IDI!$B$6:$AG$7000, COLUMN(IDI!$U$5)-COLUMN(IDI!$A$5), FALSE) ), \"\")","v":""},null,"AT1",null,"Noncumulative perpetual preferred stock and related surplus",null,null,null,null,null,null,0]
["Common Equity Tier 1 (CET1) capital",{"$f":"IFERROR(VLOOKUP(B2, IDI!$B$6:$AG$7000, COLUMN(IDI!$R$5)-COLUMN(IDI!$A$5), FALSE), \"\")","v":""},null,"Tier 2",null,"Cumulative perpetual preferred stock and related surplus, and subordinated debt and limited-life preferred stock and related surplus",null,null,null,null,null,null,0]
["Additional Tier 1 (AT1) capital",{"$f":"IFERROR(VLOOKUP(B2, IDI!$B$6:$AG$7000, COLUMN(IDI!$Q$5)-COLUMN(IDI!$A$5), FALSE)-B13, \"\")","v":""}]
["Tier 2 capital",{"$f":"IFERROR(IF(B9=\"Yes\", \"NA\", VLOOKUP(B2,IDI!$B$6:$AG$7000,COLUMN(IDI!$S$5)-COLUMN(IDI!$A$5),FALSE)-SUM(B13:B14)), \"\")","v":""},null,"Non-regulatory capital",null,"Senior debt, deposits, deferred income and all other funding instruments that do not qualify as CET1, AT1, or Tier 2 capital",null,null,null,null,null,null,0]
{"$rows_left_out":25}
{"sheet":"BHC_Estimator","index":2,"n_rows":37,"n_cols":15,"rows_kept":37,"cut":false,"hidden":false,"merged":[[35,0,35,16],[30,0,30,16],[1,5,1,8],[34,0,34,16],[36,0,36,16],[2,5,2,7],[2,8,3,8],[31,0,31,16],[5,3,5,4],[10,3,10,4],[9,3,9,4],[9,5,9,11],[11,5,11,11],[12,5,13,11],[14,5,15,11],[11,3,11,4],[12,3,13,4],[14,3,15,4],[10,5,10,11],[26,3,26,4],[22,5,22,8],[23,5,23,7],[23,8,24,8]]}
[]
["Step 1: Enter Holding Company RSSD ID:",null,null,null,null,"Current capital ratios"]
["Name",{"$f":"IFERROR(VLOOKUP(B2, BHC!B5:AC2000, COLUMN(BHC!C5)-COLUMN(BHC!A5), FALSE), \"\")","v":""},null,null,null,"Risk-based ratios",null,null,"Leverage ratio"]
[{"$f":"IFERROR(IF(VLOOKUP(B2, BHC!B6:AD2000, COLUMN(BHC!AD4)-COLUMN(BHC!A4), FALSE)=1, \"\", \"ERROR: RSSD ID chosen is not an MDI or CDFI holding company\"), \"ERROR: RSSD ID chosen is not an MDI or CDFI holding company\")","v":"ERROR: RSSD ID chosen is not an MDI or CDFI holding company"},null,null,null,null,"CET1","Tier 1","Total"]
[{"$f":"\"Reported holding company information, \"&IF(RIGHT(MAX(BHC!A6:A10000),4)=\"0331\", \"1Q\", IF(RIGHT(MAX(BHC!A6:A10000),4)=\"0630\", \"2Q\", IF(RIGHT(MAX(BHC!A6:A10000),4)=\"0930\", \"3Q\",IF(RIGHT(MAX(BHC!A6:A10000),4)=\"1231\", \"4Q\", \"     ERROR     \"))))&LEFT(MAX(BHC!A6:A10000), 4)&\" ($ th.)\"","v":"Reported holding company information, 1Q2021 ($ th.)"},null,null,null,null,{"$f":"IF(B9=\"\", \"\", IF(B7=\"Yes\", \"NA\", VLOOKUP(B2, BHC!B5:AC2000, COLUMN(BHC!R5)-COLUMN(BHC!A5), FALSE)/100 ))","v":""},{"$f":"IF(B9=\"\", \"\", IF(B7=\"Yes\", \"NA\",VLOOKUP(B2, BHC!B5:AC2000, COLUMN(BHC!S5)-COLUMN(BHC!A5), FALSE)/100 ))","v":""},{"$f":"IF(B9=\"\", \"\", IF(B7=\"Yes\", \"NA\", VLOOKUP(B2, BHC!B5:AC2000, COLUMN(BHC!T5)-COLUMN(BHC!A5), FALSE)/100 ))","v":""},{"$f":"IF(B9=\"\", \"\", VLOOKUP(B2, BHC!B5:AC2000, COLUMN(BHC!U5)-COLUMN(BHC!A5), FALSE)/100)","v":""}]
["State",{"$f":"IFERROR(VLOOKUP(B2, BHC!B5:AC2000, COLUMN(BHC!D5)-COLUMN(BHC!A5), FALSE), \"\")","v":""},null,"Exceeds CCB?",null,{"$f":"IF(B9=\"\", \"\", IF($B7=\"Yes\",\"NA\", IF(F5>7%, \"Yes\", \"No\")))","v":""},{"$f":"IF(B9=\"\", \"\", IF($B7=\"Yes\",\"NA\", IF(G5>8.5%, \"Yes\", \"No\")))","v":""},{"$f":"IF(B9=\"\", \"\", IF($B7=\"Yes\",\"NA\", IF(H5>10.5%, \"Yes\", \"No\")))","v":""},"NA"]
["CBLR holding company?1",{"$f":"IFERROR(IF(VLOOKUP(B2, BHC!B5:AC2000, COLUMN(BHC!J5)-COLUMN(BHC!A5), FALSE)=1, \"Yes\", \"No\"), \"\")","v":""},null,null,"Meets or exceeds min?",{"$f":"IF(B9=\"\", \"\", IF($B7=\"Yes\",\"NA\", IF(F5>=4.5%, \"Yes\", \"No\")))","v":""},{"$f":"IF(B9=\"\", \"\", IF($B7=\"Yes\",\"NA\", IF(G5>=6%, \"Yes\", \"No\")))","v":""},{"$f":"IF(B9=\"\", \"\", IF($B7=\"Yes\",\"NA\", IF(H5>=8%, \"Yes\", \"No\")))","v":""},{"$f":"IF(B9=\"\", \"\", IF(B7=\"Yes\",IF(I5>8.5%,\"Yes\",IF(AND(I5>7.5%,I5<=8.5%),\"Grace period\",IF(I5<=7.5%,\"Disq. from CBLR\"))),IF(B7<>\"Yes\",IF(I5>=4%,\"Yes\",\"No\"))))","v":""}]
["S-Corporation holding company?2",{"$f":"IFERROR(IF(VLOOKUP(B2, BHC!B5:AC2000, COLUMN(BHC!K5)-COLUMN(BHC!A5), FALSE)=1, \"Yes\", \"No\"), \"\")","v":""}]
["Assets",{"$f":"IFERROR(VLOOKUP(B2, BHC!B5:AC2000, COLUMN(BHC!I5)-COLUMN(BHC!A5), FALSE), \"\")","v":""},null,"Step 2: Choose investment type(s) ($ th.)"]
["Risk weighted assets (RWA)",{"$f":"IFERROR(IF(B7=\"Yes\", \"NA\", VLOOKUP(B2, BHC!B5:AC2000, COLUMN(BHC!Q5)-COLUMN(BHC!A5), FALSE) ), \"\")","v":""},null,"Capital type",null,"Qualifying instruments4",null,null,null,null,null,null,"Amount, $ th."]
["Common Equity Tier 1 (CET1) capital",{"$f":"IFERROR(VLOOKUP(B2, BHC!B5:AC2000, COLUMN(BHC!N5)-COLUMN(BHC!A5), FALSE), \"\")","v":""},null,"CET1",null,"Common stock, surplus and retained earnings",null,null,null,null,null,null,0]
["Additional Tier 1 (AT1) capital",{"$f":"IFERROR(VLOOKUP(B2, BHC!B5:AC2000, COLUMN(BHC!M5)-COLUMN(BHC!A5), FALSE)-B11, \"\")","v":""},null,"AT1",null,"Noncumulative perpetual preferred stock and related surplus",null,null,null,null,null,null,0]
["Tier 2 capital",{"$f":"IFERROR(IF(B7=\"Yes\", \"NA\", VLOOKUP(B2,BHC!B5:AC2000, COLUMN(BHC!O5)-COLUMN(BHC!A5),FALSE) - SUM(B11:B12)), \"\")","v":""},null,"Tier 2",null,"Cumulative perpetual preferred stock and related surplus, and subordinated debt and limited-life preferred stock and related surplus",null,null,null,null,null,null,0]
["Average risk-weight3",{"$f":"IFERROR(IF(B7=\"Yes\", \"NA\", B10/B9), \"\")","v":""}]
[null,null,null,"Non-regulatory capital",null,"Senior debt, deposits, deferred income and all other funding instruments that do not qualify as CET1, AT1, or Tier 2 capital",null,null,null,null,null,null,0]
{"$rows_left_out":23}
{"sheet":"Info","index":3,"n_rows":178,"n_cols":17,"rows_kept":178,"cut":false,"hidden":true,"merged":[]}
[]
[]
[null,null,null,null,null,null,null,null,null,null,null,null,null,null,null,"CDFI numbers for 1Q2021, as of 5/21/2021"]
[null,null,null,null,null,null,null,null,null,null,2,"02 - NEW YORK REGION","New York",null,null,"Need updated 1Q list of OCC's women owned banks"]
[null,null,null,null,null,null,null,null,null,null,5,"05 - ATLANTA REGION","Atlanta",null,null,"CDFI IDIs","OCC's women owned"]
[null,null,null,null,null,null,null,null,null,null,9,"09 - CHICAGO REGION","Chicago",null,null,"CERT","CERT"]
[null,null,null,null,null,null,null,null,null,null,11,"11 - KANSAS CITY REGION","Kansas City",null,null,2779,4033]
[null,null,null,null,null,null,null,null,null,null,13,"13 - DALLAS REGION","Dallas",null,null,58,25644]
[null,null,null,null,null,null,null,null,null,null,14,"14 - SAN FRANCISCO REGION","San Francisco",null,null,39,19024]
[null,null,null,null,null,null,null,null,null,null,15,"15 - WASHINGTON OFFICE - RMS","Washington, RMS",null,null,855,13798]
[null,null,null,null,null,null,null,null,null,null,16,"16 - WASHINGTON OFFICE - CFI","Washington, CFI",null,null,57483,4161]
[null,null,null,null,null,null,null,null,null,null,null,null,null,null,null,15695,14400]
[null,null,null,null,null,null,null,null,null,null,null,null,null,null,null,22229,19819]
[null,null,null,null,null,null,null,null,null,null,null,null,null,null,null,9057,26181]
[null,null,null,null,null,null,null,null,null,null,null,null,null,null,null,58357,5410]
{"$rows_left_out":164}
{"sheet":"IDI","index":4,"n_rows":5112,"n_cols":36,"rows_kept":5112,"cut":false,"hidden":true,"merged":[]}
[]
[null,null,null,null,null,null,null,"Count MDIs:",{"$f":"COUNT(IF(P6:P7000=1, B6:B7000))","v":142}]
[null,null,null,null,null,null,null,"Count FDIC MDIs:",{"$f":"COUNT(IF(P6:P7000=1, IF(H6:H7000=\"FDIC\", B6:B7000)))","v":94}]
[null,null,null,null,null,null,null,null,null,null,null,null,null,null,null,"MDI flag","Tier 1 Capital","CET1 Capital","Total Capital","Total assets for leverage ratio","SA RWA","CET1 RBC ratio","Tier 1 RBC ratio","Total RBC ratio","Leverage ratio","Cash, Noninterest-bearing balances and currency and coin","Cash, Interest-bearing balances","Total loans, domestic","Securities, HTM","Securities, AFS","Securities, equities","Trading assets","Intangible assets","CDFI IDI?","OCC's Women Owned Flag","CDFI or MDI"]
["CALLYMD","CERT","RSSDID","NAMEFULL","INSALL","ASSET","STALP","REGAGNT","BKCLASS","MUTUAL","FDICSUPV","RSSDHCR","RSSDHCD","CBLRIND","SUBCHAPS","MINORITY","RBCT1W","RBCT1C","RBCW","AVASSETW","RCR40A","RBCT1CER","RBC1RWAJ","RBCRWAJ","RBC1AAJ","CHBALNI","CHBALI","LNLSGRD","SCHANET","SCAF","SCEQFV","TRADE","INTAN","CDFI","WO Flag","CDFI or MDI"]
[20210331,39,430036,"ROBERTSON BANKING COMPANY",1,392708,"AL","FDIC","NM",0,5,2526755,2526755,0,1,0,35727,35727,39186,381655,276369,12.93,12.93,14.18,9.36,30154,28616,276004,0,50505,0,0,0,{"$f":"IFERROR(VLOOKUP(B6, Info!$P$7:$P$1000, 1, FALSE)/VLOOKUP(B6, Info!$P$7:$P$1000, 1, FALSE), 0)","v":1},{"$f":"IFERROR(VLOOKUP(B6, Info!$Q$7:$Q$1000, 1, FALSE)/VLOOKUP(B6, Info!$Q$7:$Q$1000, 1, FALSE), 0)","v":0},{"$f":"IF(OR(P6=1, AH6=1, AI6=1), 1, 0)","v":1}]
[20210331,51,382537,"THE BANK OF VERNON",1,216844,"AL","FDIC","NM",0,5,1139998,1139998,1,0,0,27007,27007,0,213202,0,null,null,null,12.67,3072,47613,132910,0,28125,0,0,0,{"$f":"IFERROR(VLOOKUP(B7, Info!$P$7:$P$1000, 1, FALSE)/VLOOKUP(B7, Info!$P$7:$P$1000, 1, FALSE), 0)","v":1},{"$f":"IFERROR(VLOOKUP(B7, Info!$Q$7:$Q$1000, 1, FALSE)/VLOOKUP(B7, Info!$Q$7:$Q$1000, 1, FALSE), 0)","v":0},{"$f":"IF(OR(P7=1, AH7=1, AI7=1), 1, 0)","v":1}]
[20210331,58,994435,"UNITED BANK",1,929024,"AL","FDIC","NM",0,5,1083895,1083895,0,0,0,82649,82649,89831,904581,573165,14.42,14.42,15.67,9.14,46234,131412,556118,14690,152525,0,0,0,{"$f":"IFERROR(VLOOKUP(B8, Info!$P$7:$P$1000, 1, FALSE)/VLOOKUP(B8, Info!$P$7:$P$1000, 1, FALSE), 0)","v":1},{"$f":"IFERROR(VLOOKUP(B8, Info!$Q$7:$Q$1000, 1, FALSE)/VLOOKUP(B8, Info!$Q$7:$Q$1000, 1, FALSE), 0)","v":0},{"$f":"IF(OR(P8=1, AH8=1, AI8=1), 1, 0)","v":1}]
[20210331,90,23643,"COMMERCIAL BANK & TRUST COMPANY",1,247993,"AR","FED","SM",0,13,1098198,1098198,1,1,0,22547,22547,0,239690,0,null,null,null,9.41,1763,4008,135656,0,83266,0,0,0,{"$f":"IFERROR(VLOOKUP(B9, Info!$P$7:$P$1000, 1, FALSE)/VLOOKUP(B9, Info!$P$7:$P$1000, 1, FALSE), 0)","v":1},{"$f":"IFERROR(VLOOKUP(B9, Info!$Q$7:$Q$1000, 1, FALSE)/VLOOKUP(B9, Info!$Q$7:$Q$1000, 1, FALSE), 0)","v":0},{"$f":"IF(OR(P9=1, AH9=1, AI9=1), 1, 0)","v":1}]
[20210331,94,843542,"FIRST STATE BANK OF WARREN",1,119983,"AR","FED","SM",0,13,1097463,1097463,1,1,0,12554,12554,0,120263,0,null,null,null,10.44,1628,6511,51495,0,56309,0,0,0,{"$f":"IFERROR(VLOOKUP(B10, Info!$P$7:$P$1000, 1, FALSE)/VLOOKUP(B10, Info!$P$7:$P$1000, 1, FALSE), 0)","v":1},{"$f":"IFERROR(VLOOKUP(B10, Info!$Q$7:$Q$1000, 1, FALSE)/VLOOKUP(B10, Info!$Q$7:$Q$1000, 1, FALSE), 0)","v":0},{"$f":"IF(OR(P10=1, AH10=1, AI10=1), 1, 0)","v":1}]
[20210331,252,365745,"PINNACLE BANK",1,238311,"IA","FED","SM",0,11,3916317,3916317,0,0,1,35960,35960,37793,223569,171949,20.91,20.91,21.98,16.079999999999998,2766,758,149013,1228,48631,0,0,5037,{"$f":"IFERROR(VLOOKUP(B11, Info!$P$7:$P$1000, 1, FALSE)/VLOOKUP(B11, Info!$P$7:$P$1000, 1, FALSE), 0)","v":0},{"$f":"IFERROR(VLOOKUP(B11, Info!$Q$7:$Q$1000, 1, FALSE)/VLOOKUP(B11, Info!$Q$7:$Q$1000, 1, FALSE), 0)","v":0},{"$f":"IF(OR(P11=1, AH11=1, AI11=1), 1, 0)","v":1}]
[20210331,306,860334,"BANK OF ZACHARY",1,325267,"LA","FDIC","NM",0,13,1086056,1086056,0,0,0,25400,25400,27407,322123,160294,15.85,15.85,17.100000000000001,7.89,3917,759,191069,0,117525,0,0,0,{"$f":"IFERROR(VLOOKUP(B12, Info!$P$7:$P$1000, 1, FALSE)/VLOOKUP(B12, Info!$P$7:$P$1000, 1, FALSE), 0)","v":1},{"$f":"IFERROR(VLOOKUP(B12, Info!$Q$7:$Q$1000, 1, FALSE)/VLOOKUP(B12, Info!$Q$7:$Q$1000, 1, FALSE), 0)","v":0},{"$f":"IF(OR(P12=1, AH12=1, AI12=1), 1, 0)","v":1}]
[20210331,307,535034,"LANDMARK BANK",1,161189,"LA","FDIC","NM",0,13,1085460,1085460,1,1,0,14823,14823,0,157153,0,null,null,null,9.43,4687,1829,102366,195,42260,0,0,0,{"$f":"IFERROR(VLOOKUP(B13, Info!$P$7:$P$1000, 1, FALSE)/VLOOKUP(B13, Info!$P$7:$P$1000, 1, FALSE), 0)","v":1},{"$f":"IFERROR(VLOOKUP(B13, Info!$Q$7:$Q$1000, 1, FALSE)/VLOOKUP(B13, Info!$Q$7:$Q$1000, 1, FALSE), 0)","v":0},{"$f":"IF(OR(P13=1, AH13=1, AI13=1), 1, 0)","v":1}]
[20210331,321,725741,"HOLMES COUNTY BANK & TRUST COMPANY",1,139978,"MS","FDIC","NM",0,13,1119057,1119057,0,1,0,16580,16580,17324,138316,59525,27.85,27.85,29.1,11.99,5598,7670,40365,817,57499,0,0,0,{"$f":"IFERROR(VLOOKUP(B14, Info!$P$7:$P$1000, 1, FALSE)/VLOOKUP(B14, Info!$P$7:$P$1000, 1, FALSE), 0)","v":1},{"$f":"IFERROR(VLOOKUP(B14, Info!$Q$7:$Q$1000, 1, FALSE)/VLOOKUP(B14, Info!$Q$7:$Q$1000, 1, FALSE), 0)","v":0},{"$f":"IF(OR(P14=1, AH14=1, AI14=1), 1, 0)","v":1}]
[20210331,324,514132,"CITIZENS BANK",1,483472,"MS","FDIC","NM",0,13,1246681,1246681,0,1,0,46817,46817,50526,479004,296147,15.81,15.81,17.059999999999999,9.77,6532,99076,310315,0,41848,0,0,0,{"$f":"IFERROR(VLOOKUP(B15, Info!$P$7:$P$1000, 1, FALSE)/VLOOKUP(B15, Info!$P$7:$P$1000, 1, FALSE), 0)","v":1},{"$f":"IFERROR(VLOOKUP(B15, Info!$Q$7:$Q$1000, 1, FALSE)/VLOOKUP(B15, Info!$Q$7:$Q$1000, 1, FALSE), 0)","v":0},{"$f":"IF(OR(P15=1, AH15=1, AI15=1), 1, 0)","v":1}]
{"$rows_left_out":5098}
{"sheet":"BHC","index":5,"n_rows":19,"n_cols":30,"rows_kept":19,"cut":false,"hidden":true,"merged":[]}
[]
[]
[]
[null,null,null,null,null,null,null,null,null,null,null,"MDI flag","Tier 1 Capital","CET1 Capital","Total Capital","Total assets for leverage ratio","SA RWA","CET1 RBC ratio","Tier 1 RBC ratio","Total RBC ratio","Leverage ratio","Cash, Noninterest-bearing balances and currency and coin","Cash, Interest-bearing balances","Total loans, domestic","Securities, HTM","Securities, AFS","Securities, equities","Trading assets","Intangible assets","Parent of an MDI or CDFI IDI?"]
["CALLYMD","RSSDID","NAMEHC","STALPHC","TOPFILER","TOPHC","ENTTYPEH","BHC","ASSET","CBLRIND","SUBCHAPS","MNRTYCDE","RBCT1W","RBCT1C","RBCW","AVASSETW","HCR40A","RBCT1CER","RBC1RWAJ","RBCRWAJ","RBC1AAJ","CHBALNI","CHBALI","LNLSGRD","SCHANET","SCAF","SCEQFV","TRADE","INTAN","CDFI_MDI_holdco"]
[20210331,1097306,"BANCPLUS CORP","MS",1,1,"BHC",1,4951264,0,0,0,403300,352466,502021,4803987,3509917,10.039999999999999,11.49,14.3,8.4,98920,483155,3427393,90818,572888,0,0,8258,{"$f":"IFERROR(VLOOKUP(B6, IDI!$L$6:$L$7000, 1, FALSE)/VLOOKUP(B6, IDI!$L$6:$L$7000, 1, FALSE), 0)","v":1}]
[20210331,1104231,"INTERNATIONAL BANCSHARES CORP","TX",1,1,"FHD",1,14921535,0,0,0,2007469,1892259,2119550,13821190,9820729,19.27,20.440000000000001,21.58,14.52,329809,1637961,7462359,3400,4057356,6126,0,284078,{"$f":"IFERROR(VLOOKUP(B7, IDI!$L$6:$L$7000, 1, FALSE)/VLOOKUP(B7, IDI!$L$6:$L$7000, 1, FALSE), 0)","v":1}]
[20210331,1129382,"POPULAR INC","PR",1,1,"FHD",1,66870000,0,0,0,5274000,5252000,6033000,65460000,30745000,17.079999999999998,17.149999999999999,19.62,8.06,496000,11568000,23807000,293000,22772000,32000,36000,815000,{"$f":"IFERROR(VLOOKUP(B8, IDI!$L$6:$L$7000, 1, FALSE)/VLOOKUP(B8, IDI!$L$6:$L$7000, 1, FALSE), 0)","v":1}]
[20210331,1136661,"OCEAN BANKSHARES INC","FL",1,1,"BHC",1,4709246,0,0,0,479526,479526,569423,4568312,3851965,12.45,12.45,14.78,10.5,37579,366730,3737679,0,380531,1964,0,1532,{"$f":"IFERROR(VLOOKUP(B9, IDI!$L$6:$L$7000, 1, FALSE)/VLOOKUP(B9, IDI!$L$6:$L$7000, 1, FALSE), 0)","v":1}]
[20210331,1843080,"CATHAY GENERAL BCORP","CA",1,1,"BHC",1,19230188,0,0,0,2066900,2066900,2334634,18605062,14760804,14,14,15.82,11.11,141884,1612411,15403569,0,908844,20993,0,377438,{"$f":"IFERROR(VLOOKUP(B10, IDI!$L$6:$L$7000, 1, FALSE)/VLOOKUP(B10, IDI!$L$6:$L$7000, 1, FALSE), 0)","v":1}]
[20210331,1995523,"M&F BCORP INC","MS",1,1,"BHC",1,126584,1,1,0,13745,13745,null,121992,null,null,null,null,11.27,4134,16735,48916,0,49220,0,0,0,{"$f":"IFERROR(VLOOKUP(B11, IDI!$L$6:$L$7000, 1, FALSE)/VLOOKUP(B11, IDI!$L$6:$L$7000, 1, FALSE), 0)","v":1}]
[20210331,2385493,"FIRST BANCSHARES INC THE","MS",1,1,"FHD",1,5445729,0,0,0,462638,447324,623063,5156839,3230957,13.84,14.32,19.28,8.9700000000000006,117269,695738,3070212,0,1135188,0,0,186648,{"$f":"IFERROR(VLOOKUP(B12, IDI!$L$6:$L$7000, 1, FALSE)/VLOOKUP(B12, IDI!$L$6:$L$7000, 1, FALSE), 0)","v":1}]
[20210331,2490575,"OFG BCORP","PR",1,1,"FHD",1,10153342,0,0,0,1036726,919856,1121829,9890379,6782685,13.56,15.28,16.54,10.48,58687,2306197,6634052,126767,471009,12423,24,177425,{"$f":"IFERROR(VLOOKUP(B13, IDI!$L$6:$L$7000, 1, FALSE)/VLOOKUP(B13, IDI!$L$6:$L$7000, 1, FALSE), 0)","v":1}]
[20210331,2531245,"CARVER BCORP INC","NY",1,1,"THC",0,676748,0,0,0,68593,29412,73938,665219,455334,6.46,15.06,16.239999999999998,10.31,3286,72305,483548,7807,86507,0,0,147,{"$f":"IFERROR(VLOOKUP(B14, IDI!$L$6:$L$7000, 1, FALSE)/VLOOKUP(B14, IDI!$L$6:$L$7000, 1, FALSE), 0)","v":1}]
[20210331,2734233,"EAST WEST BCORP INC","CA",1,1,"FHD",1,56874146,0,0,0,5028584,5028584,5647260,55223385,39572396,12.71,12.71,14.27,9.11,587465,4773591,38978591,0,7789213,26693,0,476848,{"$f":"IFERROR(VLOOKUP(B15, IDI!$L$6:$L$7000, 1, FALSE)/VLOOKUP(B15, IDI!$L$6:$L$7000, 1, FALSE), 0)","v":1}]
{"$rows_left_out":4}